blob: 649373ea46e1d8160fa77d815e736fc76f1e29c8 [file] [log] [blame]
-------------------------------------------------------------------------------
Test set: TestSuite
-------------------------------------------------------------------------------
Tests run: 76, Failures: 6, Errors: 0, Skipped: 21, Time elapsed: 746.901 sec <<< FAILURE!
testAddAndRemoveFloatingIp(org.jclouds.openstack.nova.v2_0.extensions.FloatingIPApiLiveTest) Time elapsed: 0.091 sec <<< FAILURE!
java.lang.NullPointerException
at org.jclouds.openstack.nova.v2_0.internal.BaseNovaApiLiveTest.blockUntilServerInState(BaseNovaApiLiveTest.java:99)
at org.jclouds.openstack.nova.v2_0.internal.BaseNovaApiLiveTest.createServerInZone(BaseNovaApiLiveTest.java:88)
at org.jclouds.openstack.nova.v2_0.extensions.FloatingIPApiLiveTest.testAddAndRemoveFloatingIp(FloatingIPApiLiveTest.java:109)
testCreateVolume(org.jclouds.openstack.nova.v2_0.extensions.VolumeApiLiveTest) Time elapsed: 0.288 sec <<< FAILURE!
org.jclouds.rest.InsufficientResourcesException: {"overLimit": {"message": "Volume quota exceeded. You cannot create a volume of size 1G", "code": 413, "retryAfter": 0}}
at org.jclouds.openstack.nova.v2_0.handlers.NovaErrorHandler.handleError(NovaErrorHandler.java:71)
at org.jclouds.http.handlers.DelegatingErrorHandler.handleError(DelegatingErrorHandler.java:69)
at org.jclouds.http.internal.BaseHttpCommandExecutorService$HttpResponseCallable.shouldContinue(BaseHttpCommandExecutorService.java:197)
at org.jclouds.http.internal.BaseHttpCommandExecutorService$HttpResponseCallable.call(BaseHttpCommandExecutorService.java:167)
at org.jclouds.http.internal.BaseHttpCommandExecutorService$HttpResponseCallable.call(BaseHttpCommandExecutorService.java:135)
at java.util.concurrent.FutureTask$Sync.innerRun(FutureTask.java:303)
at java.util.concurrent.FutureTask.run(FutureTask.java:138)
at java.util.concurrent.ThreadPoolExecutor$Worker.runTask(ThreadPoolExecutor.java:886)
at java.util.concurrent.ThreadPoolExecutor$Worker.run(ThreadPoolExecutor.java:908)
at java.lang.Thread.run(Thread.java:680)
at org.jclouds.concurrent.config.DescribingExecutorService.submit(DescribingExecutorService.java:89)
at org.jclouds.http.internal.BaseHttpCommandExecutorService.submit(BaseHttpCommandExecutorService.java:132)
at org.jclouds.http.TransformingHttpCommandExecutorServiceImpl.submit(TransformingHttpCommandExecutorServiceImpl.java:54)
at org.jclouds.http.TransformingHttpCommandImpl.execute(TransformingHttpCommandImpl.java:73)
at org.jclouds.rest.internal.AsyncRestClientProxy.createListenableFutureForHttpRequestMappedToMethodAndArgs(AsyncRestClientProxy.java:248)
at org.jclouds.rest.internal.AsyncRestClientProxy.invoke(AsyncRestClientProxy.java:148)
at $Proxy120.create(Unknown Source)
at sun.reflect.NativeMethodAccessorImpl.invoke0(Native Method)
at sun.reflect.NativeMethodAccessorImpl.invoke(NativeMethodAccessorImpl.java:39)
at sun.reflect.DelegatingMethodAccessorImpl.invoke(DelegatingMethodAccessorImpl.java:25)
at java.lang.reflect.Method.invoke(Method.java:597)
at org.jclouds.concurrent.internal.SyncProxy.invoke(SyncProxy.java:164)
at $Proxy121.create(Unknown Source)
at org.jclouds.openstack.nova.v2_0.extensions.VolumeApiLiveTest.testCreateVolume(VolumeApiLiveTest.java:95)
at sun.reflect.NativeMethodAccessorImpl.invoke0(Native Method)
at sun.reflect.NativeMethodAccessorImpl.invoke(NativeMethodAccessorImpl.java:39)
at sun.reflect.DelegatingMethodAccessorImpl.invoke(DelegatingMethodAccessorImpl.java:25)
at java.lang.reflect.Method.invoke(Method.java:597)
at org.testng.internal.MethodInvocationHelper.invokeMethod(MethodInvocationHelper.java:80)
at org.testng.internal.Invoker.invokeMethod(Invoker.java:702)
at org.testng.internal.Invoker.invokeTestMethod(Invoker.java:894)
at org.testng.internal.Invoker.invokeTestMethods(Invoker.java:1219)
at org.testng.internal.TestMethodWorker.invokeTestMethods(TestMethodWorker.java:127)
at org.testng.internal.TestMethodWorker.run(TestMethodWorker.java:111)
at org.testng.TestRunner.privateRun(TestRunner.java:768)
at org.testng.TestRunner.run(TestRunner.java:617)
at org.testng.SuiteRunner.runTest(SuiteRunner.java:334)
at org.testng.SuiteRunner.access$000(SuiteRunner.java:37)
at org.testng.SuiteRunner$SuiteWorker.run(SuiteRunner.java:368)
at org.testng.internal.thread.ThreadUtil$2.call(ThreadUtil.java:64)
at java.util.concurrent.FutureTask$Sync.innerRun(FutureTask.java:303)
at java.util.concurrent.FutureTask.run(FutureTask.java:138)
at java.util.concurrent.ThreadPoolExecutor$Worker.runTask(ThreadPoolExecutor.java:886)
at java.util.concurrent.ThreadPoolExecutor$Worker.run(ThreadPoolExecutor.java:908)
at java.lang.Thread.run(Thread.java:680)
at org.jclouds.concurrent.config.DescribingExecutorService.submit(DescribingExecutorService.java:89)
at org.jclouds.http.internal.BaseHttpCommandExecutorService.submit(BaseHttpCommandExecutorService.java:132)
at org.jclouds.http.TransformingHttpCommandExecutorServiceImpl.submit(TransformingHttpCommandExecutorServiceImpl.java:54)
at org.jclouds.http.TransformingHttpCommandImpl.execute(TransformingHttpCommandImpl.java:73)
at org.jclouds.rest.internal.AsyncRestClientProxy.createListenableFutureForHttpRequestMappedToMethodAndArgs(AsyncRestClientProxy.java:248)
at org.jclouds.rest.internal.AsyncRestClientProxy.invoke(AsyncRestClientProxy.java:148)
at $Proxy120.create(Unknown Source)
at sun.reflect.NativeMethodAccessorImpl.invoke0(Native Method)
at sun.reflect.NativeMethodAccessorImpl.invoke(NativeMethodAccessorImpl.java:39)
at sun.reflect.DelegatingMethodAccessorImpl.invoke(DelegatingMethodAccessorImpl.java:25)
at java.lang.reflect.Method.invoke(Method.java:597)
at org.jclouds.concurrent.internal.SyncProxy.invoke(SyncProxy.java:164)
at $Proxy121.create(Unknown Source)
at org.jclouds.openstack.nova.v2_0.extensions.VolumeApiLiveTest.testCreateVolume(VolumeApiLiveTest.java:95)
Caused by: org.jclouds.http.HttpResponseException: command: POST https://az-1.region-a.geo-1.compute.hpcloudsvc.com/v1.1/37936628937291/os-volumes HTTP/1.1 failed with response: HTTP/1.1 413 Request Entity Too Large; content: [{"overLimit": {"message": "Volume quota exceeded. You cannot create a volume of size 1G", "code": 413, "retryAfter": 0}}]
at org.jclouds.openstack.nova.v2_0.handlers.NovaErrorHandler.handleError(NovaErrorHandler.java:48)
at org.jclouds.http.handlers.DelegatingErrorHandler.handleError(DelegatingErrorHandler.java:69)
at org.jclouds.http.internal.BaseHttpCommandExecutorService$HttpResponseCallable.shouldContinue(BaseHttpCommandExecutorService.java:197)
at org.jclouds.http.internal.BaseHttpCommandExecutorService$HttpResponseCallable.call(BaseHttpCommandExecutorService.java:167)
at org.jclouds.http.internal.BaseHttpCommandExecutorService$HttpResponseCallable.call(BaseHttpCommandExecutorService.java:135)
... 5 more
testCreateImage(org.jclouds.openstack.nova.v2_0.compute.extensions.NovaImageExtensionLiveTest) Time elapsed: 48.583 sec <<< FAILURE!
org.jclouds.rest.AuthorizationException: (ubuntu:pw[1d030d989d8c067f156f728794423e19]@15.185.225.162:22) (ubuntu:pw[1d030d989d8c067f156f728794423e19]@15.185.225.162:22) error acquiring {hostAndPort=15.185.225.162:22, loginUser=ubuntu, ssh=null, connectTimeout=60000, sessionTimeout=60000} (out of retries - max 7): Exhausted available authentication methods
at org.jclouds.sshj.SshjSshClient.propagate(SshjSshClient.java:380)
at org.jclouds.sshj.SshjSshClient.acquire(SshjSshClient.java:201)
at org.jclouds.sshj.SshjSshClient.connect(SshjSshClient.java:221)
at org.jclouds.compute.extensions.internal.BaseImageExtensionLiveTest$2.apply(BaseImageExtensionLiveTest.java:180)
at org.jclouds.compute.extensions.internal.BaseImageExtensionLiveTest$2.apply(BaseImageExtensionLiveTest.java:177)
at org.jclouds.predicates.RetryablePredicate.apply(RetryablePredicate.java:76)
at org.jclouds.compute.extensions.internal.BaseImageExtensionLiveTest.checkReachable(BaseImageExtensionLiveTest.java:177)
at org.jclouds.compute.extensions.internal.BaseImageExtensionLiveTest.testCreateImage(BaseImageExtensionLiveTest.java:105)
at sun.reflect.NativeMethodAccessorImpl.invoke0(Native Method)
at sun.reflect.NativeMethodAccessorImpl.invoke(NativeMethodAccessorImpl.java:39)
at sun.reflect.DelegatingMethodAccessorImpl.invoke(DelegatingMethodAccessorImpl.java:25)
at java.lang.reflect.Method.invoke(Method.java:597)
at org.testng.internal.MethodInvocationHelper.invokeMethod(MethodInvocationHelper.java:80)
at org.testng.internal.Invoker.invokeMethod(Invoker.java:702)
at org.testng.internal.Invoker.invokeTestMethod(Invoker.java:894)
at org.testng.internal.Invoker.invokeTestMethods(Invoker.java:1219)
at org.testng.internal.TestMethodWorker.invokeTestMethods(TestMethodWorker.java:127)
at org.testng.internal.TestMethodWorker.run(TestMethodWorker.java:111)
at org.testng.TestRunner.privateRun(TestRunner.java:768)
at org.testng.TestRunner.run(TestRunner.java:617)
at org.testng.SuiteRunner.runTest(SuiteRunner.java:334)
at org.testng.SuiteRunner.access$000(SuiteRunner.java:37)
at org.testng.SuiteRunner$SuiteWorker.run(SuiteRunner.java:368)
at org.testng.internal.thread.ThreadUtil$2.call(ThreadUtil.java:64)
at java.util.concurrent.FutureTask$Sync.innerRun(FutureTask.java:303)
at java.util.concurrent.FutureTask.run(FutureTask.java:138)
at java.util.concurrent.ThreadPoolExecutor$Worker.runTask(ThreadPoolExecutor.java:886)
at java.util.concurrent.ThreadPoolExecutor$Worker.run(ThreadPoolExecutor.java:908)
at java.lang.Thread.run(Thread.java:680)
Caused by: net.schmizz.sshj.userauth.UserAuthException: Exhausted available authentication methods
at net.schmizz.sshj.userauth.UserAuthImpl.authenticate(UserAuthImpl.java:114)
at net.schmizz.sshj.SSHClient.auth(SSHClient.java:205)
at net.schmizz.sshj.SSHClient.auth(SSHClient.java:190)
at net.schmizz.sshj.SSHClient.authPassword(SSHClient.java:266)
at net.schmizz.sshj.SSHClient.authPassword(SSHClient.java:236)
at net.schmizz.sshj.SSHClient.authPassword(SSHClient.java:220)
at org.jclouds.sshj.SSHClientConnection.create(SSHClientConnection.java:140)
at org.jclouds.sshj.SSHClientConnection.create(SSHClientConnection.java:40)
at org.jclouds.sshj.SshjSshClient.acquire(SshjSshClient.java:191)
... 27 more
Caused by: net.schmizz.sshj.userauth.UserAuthException: keyboard-interactive auth not allowed by server
at net.schmizz.sshj.userauth.UserAuthImpl.authenticate(UserAuthImpl.java:81)
... 35 more
Caused by: net.schmizz.sshj.userauth.UserAuthException: Exhausted available authentication methods
at net.schmizz.sshj.userauth.UserAuthImpl.authenticate(UserAuthImpl.java:114)
at net.schmizz.sshj.SSHClient.auth(SSHClient.java:205)
at net.schmizz.sshj.SSHClient.auth(SSHClient.java:190)
at net.schmizz.sshj.SSHClient.authPassword(SSHClient.java:266)
at net.schmizz.sshj.SSHClient.authPassword(SSHClient.java:236)
at net.schmizz.sshj.SSHClient.authPassword(SSHClient.java:220)
at org.jclouds.sshj.SSHClientConnection.create(SSHClientConnection.java:140)
at org.jclouds.sshj.SSHClientConnection.create(SSHClientConnection.java:40)
at org.jclouds.sshj.SshjSshClient.acquire(SshjSshClient.java:191)
... 27 more
Caused by: net.schmizz.sshj.userauth.UserAuthException: keyboard-interactive auth not allowed by server
at net.schmizz.sshj.userauth.UserAuthImpl.authenticate(UserAuthImpl.java:81)
... 35 more
testCreateAndRunAService(org.jclouds.openstack.nova.v2_0.compute.NovaComputeServiceLiveTest) Time elapsed: 77.646 sec <<< FAILURE!
org.jclouds.rest.AuthorizationException: (ubuntu:pw[0d37dd3f866d4c2cb72644a15f10869f]@15.185.224.249:22) (ubuntu:pw[0d37dd3f866d4c2cb72644a15f10869f]@15.185.224.249:22) error acquiring {hostAndPort=15.185.224.249:22, loginUser=ubuntu, ssh=null, connectTimeout=60000, sessionTimeout=60000} (out of retries - max 7): Exhausted available authentication methods
at org.jclouds.sshj.SshjSshClient.propagate(SshjSshClient.java:380)
at org.jclouds.sshj.SshjSshClient.acquire(SshjSshClient.java:201)
at org.jclouds.sshj.SshjSshClient.connect(SshjSshClient.java:221)
at org.jclouds.compute.callables.RunScriptOnNodeAsInitScriptUsingSsh.call(RunScriptOnNodeAsInitScriptUsingSsh.java:78)
at org.jclouds.compute.internal.BaseComputeService.runScriptOnNode(BaseComputeService.java:601)
at sun.reflect.NativeMethodAccessorImpl.invoke0(Native Method)
at sun.reflect.NativeMethodAccessorImpl.invoke(NativeMethodAccessorImpl.java:39)
at sun.reflect.DelegatingMethodAccessorImpl.invoke(DelegatingMethodAccessorImpl.java:25)
at java.lang.reflect.Method.invoke(Method.java:597)
at com.google.inject.internal.DelegatingInvocationHandler.invoke(DelegatingInvocationHandler.java:37)
at $Proxy77.runScriptOnNode(Unknown Source)
at org.jclouds.compute.internal.BaseComputeServiceLiveTest.createAndRunAServiceInGroup(BaseComputeServiceLiveTest.java:667)
at org.jclouds.compute.internal.BaseComputeServiceLiveTest.testCreateAndRunAService(BaseComputeServiceLiveTest.java:640)
at sun.reflect.NativeMethodAccessorImpl.invoke0(Native Method)
at sun.reflect.NativeMethodAccessorImpl.invoke(NativeMethodAccessorImpl.java:39)
at sun.reflect.DelegatingMethodAccessorImpl.invoke(DelegatingMethodAccessorImpl.java:25)
at java.lang.reflect.Method.invoke(Method.java:597)
at org.testng.internal.MethodInvocationHelper.invokeMethod(MethodInvocationHelper.java:80)
at org.testng.internal.Invoker.invokeMethod(Invoker.java:702)
at org.testng.internal.Invoker.invokeTestMethod(Invoker.java:894)
at org.testng.internal.Invoker.invokeTestMethods(Invoker.java:1219)
at org.testng.internal.TestMethodWorker.invokeTestMethods(TestMethodWorker.java:127)
at org.testng.internal.TestMethodWorker.run(TestMethodWorker.java:111)
at org.testng.TestRunner.privateRun(TestRunner.java:768)
at org.testng.TestRunner.run(TestRunner.java:617)
at org.testng.SuiteRunner.runTest(SuiteRunner.java:334)
at org.testng.SuiteRunner.access$000(SuiteRunner.java:37)
at org.testng.SuiteRunner$SuiteWorker.run(SuiteRunner.java:368)
at org.testng.internal.thread.ThreadUtil$2.call(ThreadUtil.java:64)
at java.util.concurrent.FutureTask$Sync.innerRun(FutureTask.java:303)
at java.util.concurrent.FutureTask.run(FutureTask.java:138)
at java.util.concurrent.ThreadPoolExecutor$Worker.runTask(ThreadPoolExecutor.java:886)
at java.util.concurrent.ThreadPoolExecutor$Worker.run(ThreadPoolExecutor.java:908)
at java.lang.Thread.run(Thread.java:680)
Caused by: net.schmizz.sshj.userauth.UserAuthException: Exhausted available authentication methods
at net.schmizz.sshj.userauth.UserAuthImpl.authenticate(UserAuthImpl.java:114)
at net.schmizz.sshj.SSHClient.auth(SSHClient.java:205)
at net.schmizz.sshj.SSHClient.auth(SSHClient.java:190)
at net.schmizz.sshj.SSHClient.authPassword(SSHClient.java:266)
at net.schmizz.sshj.SSHClient.authPassword(SSHClient.java:236)
at net.schmizz.sshj.SSHClient.authPassword(SSHClient.java:220)
at org.jclouds.sshj.SSHClientConnection.create(SSHClientConnection.java:140)
at org.jclouds.sshj.SSHClientConnection.create(SSHClientConnection.java:40)
at org.jclouds.sshj.SshjSshClient.acquire(SshjSshClient.java:191)
... 32 more
Caused by: net.schmizz.sshj.userauth.UserAuthException: keyboard-interactive auth not allowed by server
at net.schmizz.sshj.userauth.UserAuthImpl.authenticate(UserAuthImpl.java:81)
... 40 more
Caused by: net.schmizz.sshj.userauth.UserAuthException: Exhausted available authentication methods
at net.schmizz.sshj.userauth.UserAuthImpl.authenticate(UserAuthImpl.java:114)
at net.schmizz.sshj.SSHClient.auth(SSHClient.java:205)
at net.schmizz.sshj.SSHClient.auth(SSHClient.java:190)
at net.schmizz.sshj.SSHClient.authPassword(SSHClient.java:266)
at net.schmizz.sshj.SSHClient.authPassword(SSHClient.java:236)
at net.schmizz.sshj.SSHClient.authPassword(SSHClient.java:220)
at org.jclouds.sshj.SSHClientConnection.create(SSHClientConnection.java:140)
at org.jclouds.sshj.SSHClientConnection.create(SSHClientConnection.java:40)
at org.jclouds.sshj.SshjSshClient.acquire(SshjSshClient.java:191)
... 32 more
Caused by: net.schmizz.sshj.userauth.UserAuthException: keyboard-interactive auth not allowed by server
at net.schmizz.sshj.userauth.UserAuthImpl.authenticate(UserAuthImpl.java:81)
... 40 more
testAScriptExecutionAfterBootWithBasicTemplate(org.jclouds.openstack.nova.v2_0.compute.NovaComputeServiceLiveTest) Time elapsed: 159.988 sec <<< FAILURE!
org.jclouds.compute.RunNodesException: error running 1 node group(openstack-novar) location(az-3.region-a.geo-1) image(120) size(100) options({blockOnPort:seconds=22:120, autoAssignFloatingIp=false})
Execution failures:
0 error[s]
Node failures:
1) NoSuchElementException on node az-3.region-a.geo-1/211985:
java.util.NoSuchElementException: could not connect to any ip address port 22 on node {id=az-3.region-a.geo-1/211985, providerId=211985, name=openstack-novar-3c, location={scope=HOST, id=6f9484a69d38f788bd6c4c3724a8b5f91f2ee2b14018e267842d2a90, description=6f9484a69d38f788bd6c4c3724a8b5f91f2ee2b14018e267842d2a90, parent=az-3.region-a.geo-1}, group=openstack-novar, imageId=az-3.region-a.geo-1/120, os={family=ubuntu, name=Ubuntu Precise 12.04 LTS Server 64-bit 20120424, version=12.04, description=Ubuntu Precise 12.04 LTS Server 64-bit 20120424, is64Bit=true}, status=RUNNING, loginPort=22, hostname=openstack-novar-3c, privateAddresses=[10.2.83.191], publicAddresses=[15.185.224.44], hardware={id=az-3.region-a.geo-1/100, providerId=100, name=standard.xsmall, location={scope=ZONE, id=az-3.region-a.geo-1, description=az-3.region-a.geo-1, parent=openstack-nova}, processors=[{cores=1.0, speed=1.0}], ram=1024, volumes=[{type=LOCAL, size=30.0, bootDevice=true, durable=true}], supportsImage=ALWAYS_TRUE}, loginUser=ubuntu}
at org.jclouds.compute.util.ConcurrentOpenSocketFinder.findOpenSocketOnNode(ConcurrentOpenSocketFinder.java:98)
at org.jclouds.compute.strategy.CustomizeNodeAndAddToGoodMapOrPutExceptionIntoBadMap.call(CustomizeNodeAndAddToGoodMapOrPutExceptionIntoBadMap.java:168)
at org.jclouds.compute.strategy.CustomizeNodeAndAddToGoodMapOrPutExceptionIntoBadMap.apply(CustomizeNodeAndAddToGoodMapOrPutExceptionIntoBadMap.java:184)
at org.jclouds.compute.strategy.CustomizeNodeAndAddToGoodMapOrPutExceptionIntoBadMap.apply(CustomizeNodeAndAddToGoodMapOrPutExceptionIntoBadMap.java:60)
at com.google.common.util.concurrent.Futures$3.apply(Futures.java:376)
at com.google.common.util.concurrent.Futures$ChainingListenableFuture.run(Futures.java:518)
at java.util.concurrent.ThreadPoolExecutor$Worker.runTask(ThreadPoolExecutor.java:886)
at java.util.concurrent.ThreadPoolExecutor$Worker.run(ThreadPoolExecutor.java:908)
at java.lang.Thread.run(Thread.java:680)
1 error[s]
at org.jclouds.compute.internal.BaseComputeService.createNodesInGroup(BaseComputeService.java:221)
at org.jclouds.compute.internal.BaseComputeService.createNodesInGroup(BaseComputeService.java:229)
at sun.reflect.NativeMethodAccessorImpl.invoke0(Native Method)
at sun.reflect.NativeMethodAccessorImpl.invoke(NativeMethodAccessorImpl.java:39)
at sun.reflect.DelegatingMethodAccessorImpl.invoke(DelegatingMethodAccessorImpl.java:25)
at java.lang.reflect.Method.invoke(Method.java:597)
at com.google.inject.internal.DelegatingInvocationHandler.invoke(DelegatingInvocationHandler.java:37)
at $Proxy77.createNodesInGroup(Unknown Source)
at org.jclouds.compute.internal.BaseComputeServiceLiveTest.testAScriptExecutionAfterBootWithBasicTemplate(BaseComputeServiceLiveTest.java:220)
at sun.reflect.NativeMethodAccessorImpl.invoke0(Native Method)
at sun.reflect.NativeMethodAccessorImpl.invoke(NativeMethodAccessorImpl.java:39)
at sun.reflect.DelegatingMethodAccessorImpl.invoke(DelegatingMethodAccessorImpl.java:25)
at java.lang.reflect.Method.invoke(Method.java:597)
at org.testng.internal.MethodInvocationHelper.invokeMethod(MethodInvocationHelper.java:80)
at org.testng.internal.Invoker.invokeMethod(Invoker.java:702)
at org.testng.internal.Invoker.invokeTestMethod(Invoker.java:894)
at org.testng.internal.Invoker.invokeTestMethods(Invoker.java:1219)
at org.testng.internal.TestMethodWorker.invokeTestMethods(TestMethodWorker.java:127)
at org.testng.internal.TestMethodWorker.run(TestMethodWorker.java:111)
at org.testng.TestRunner.privateRun(TestRunner.java:768)
at org.testng.TestRunner.run(TestRunner.java:617)
at org.testng.SuiteRunner.runTest(SuiteRunner.java:334)
at org.testng.SuiteRunner.access$000(SuiteRunner.java:37)
at org.testng.SuiteRunner$SuiteWorker.run(SuiteRunner.java:368)
at org.testng.internal.thread.ThreadUtil$2.call(ThreadUtil.java:64)
at java.util.concurrent.FutureTask$Sync.innerRun(FutureTask.java:303)
at java.util.concurrent.FutureTask.run(FutureTask.java:138)
at java.util.concurrent.ThreadPoolExecutor$Worker.runTask(ThreadPoolExecutor.java:886)
at java.util.concurrent.ThreadPoolExecutor$Worker.run(ThreadPoolExecutor.java:908)
at java.lang.Thread.run(Thread.java:680)
testCreateTwoNodesWithRunScript(org.jclouds.openstack.nova.v2_0.compute.NovaComputeServiceLiveTest) Time elapsed: 117.17 sec <<< FAILURE!
org.jclouds.compute.RunNodesException: error running 2 nodes group(openstack-nova) location(az-3.region-a.geo-1) image(120) size(100) options({scriptPresent=true, autoAssignFloatingIp=false})
Execution failures:
0 error[s]
Node failures:
1) AuthorizationException on node az-3.region-a.geo-1/212001:
org.jclouds.rest.AuthorizationException: (ubuntu:pw[750b9014020d8d1e9fc2d5e31b170530]@15.185.226.148:22) (ubuntu:pw[750b9014020d8d1e9fc2d5e31b170530]@15.185.226.148:22) error acquiring {hostAndPort=15.185.226.148:22, loginUser=ubuntu, ssh=null, connectTimeout=60000, sessionTimeout=60000} (out of retries - max 7): Exhausted available authentication methods
at org.jclouds.sshj.SshjSshClient.propagate(SshjSshClient.java:380)
at org.jclouds.sshj.SshjSshClient.acquire(SshjSshClient.java:201)
at org.jclouds.sshj.SshjSshClient.connect(SshjSshClient.java:221)
at org.jclouds.compute.callables.RunScriptOnNodeAsInitScriptUsingSsh.call(RunScriptOnNodeAsInitScriptUsingSsh.java:78)
at org.jclouds.compute.strategy.CustomizeNodeAndAddToGoodMapOrPutExceptionIntoBadMap.call(CustomizeNodeAndAddToGoodMapOrPutExceptionIntoBadMap.java:163)
at org.jclouds.compute.strategy.CustomizeNodeAndAddToGoodMapOrPutExceptionIntoBadMap.apply(CustomizeNodeAndAddToGoodMapOrPutExceptionIntoBadMap.java:184)
at org.jclouds.compute.strategy.CustomizeNodeAndAddToGoodMapOrPutExceptionIntoBadMap.apply(CustomizeNodeAndAddToGoodMapOrPutExceptionIntoBadMap.java:60)
at com.google.common.util.concurrent.Futures$3.apply(Futures.java:376)
at com.google.common.util.concurrent.Futures$ChainingListenableFuture.run(Futures.java:518)
at java.util.concurrent.ThreadPoolExecutor$Worker.runTask(ThreadPoolExecutor.java:886)
at java.util.concurrent.ThreadPoolExecutor$Worker.run(ThreadPoolExecutor.java:908)
at java.lang.Thread.run(Thread.java:680)
Caused by: net.schmizz.sshj.userauth.UserAuthException: Exhausted available authentication methods
at net.schmizz.sshj.userauth.UserAuthImpl.authenticate(UserAuthImpl.java:114)
at net.schmizz.sshj.SSHClient.auth(SSHClient.java:205)
at net.schmizz.sshj.SSHClient.auth(SSHClient.java:190)
at net.schmizz.sshj.SSHClient.authPassword(SSHClient.java:266)
at net.schmizz.sshj.SSHClient.authPassword(SSHClient.java:236)
at net.schmizz.sshj.SSHClient.authPassword(SSHClient.java:220)
at org.jclouds.sshj.SSHClientConnection.create(SSHClientConnection.java:140)
at org.jclouds.sshj.SSHClientConnection.create(SSHClientConnection.java:40)
at org.jclouds.sshj.SshjSshClient.acquire(SshjSshClient.java:191)
... 10 more
Caused by: net.schmizz.sshj.userauth.UserAuthException: keyboard-interactive auth not allowed by server
at net.schmizz.sshj.userauth.UserAuthImpl.authenticate(UserAuthImpl.java:81)
... 18 more
2) AuthorizationException on node az-3.region-a.geo-1/212003:
org.jclouds.rest.AuthorizationException: (ubuntu:pw[aca5038b5a84f91323e16706c3ec745a]@15.185.226.221:22) (ubuntu:pw[aca5038b5a84f91323e16706c3ec745a]@15.185.226.221:22) error acquiring {hostAndPort=15.185.226.221:22, loginUser=ubuntu, ssh=null, connectTimeout=60000, sessionTimeout=60000} (out of retries - max 7): Exhausted available authentication methods
at org.jclouds.sshj.SshjSshClient.propagate(SshjSshClient.java:380)
at org.jclouds.sshj.SshjSshClient.acquire(SshjSshClient.java:201)
at org.jclouds.sshj.SshjSshClient.connect(SshjSshClient.java:221)
at org.jclouds.compute.callables.RunScriptOnNodeAsInitScriptUsingSsh.call(RunScriptOnNodeAsInitScriptUsingSsh.java:78)
at org.jclouds.compute.strategy.CustomizeNodeAndAddToGoodMapOrPutExceptionIntoBadMap.call(CustomizeNodeAndAddToGoodMapOrPutExceptionIntoBadMap.java:163)
at org.jclouds.compute.strategy.CustomizeNodeAndAddToGoodMapOrPutExceptionIntoBadMap.apply(CustomizeNodeAndAddToGoodMapOrPutExceptionIntoBadMap.java:184)
at org.jclouds.compute.strategy.CustomizeNodeAndAddToGoodMapOrPutExceptionIntoBadMap.apply(CustomizeNodeAndAddToGoodMapOrPutExceptionIntoBadMap.java:60)
at com.google.common.util.concurrent.Futures$3.apply(Futures.java:376)
at com.google.common.util.concurrent.Futures$ChainingListenableFuture.run(Futures.java:518)
at java.util.concurrent.ThreadPoolExecutor$Worker.runTask(ThreadPoolExecutor.java:886)
at java.util.concurrent.ThreadPoolExecutor$Worker.run(ThreadPoolExecutor.java:908)
at java.lang.Thread.run(Thread.java:680)
Caused by: net.schmizz.sshj.userauth.UserAuthException: Exhausted available authentication methods
at net.schmizz.sshj.userauth.UserAuthImpl.authenticate(UserAuthImpl.java:114)
at net.schmizz.sshj.SSHClient.auth(SSHClient.java:205)
at net.schmizz.sshj.SSHClient.auth(SSHClient.java:190)
at net.schmizz.sshj.SSHClient.authPassword(SSHClient.java:266)
at net.schmizz.sshj.SSHClient.authPassword(SSHClient.java:236)
at net.schmizz.sshj.SSHClient.authPassword(SSHClient.java:220)
at org.jclouds.sshj.SSHClientConnection.create(SSHClientConnection.java:140)
at org.jclouds.sshj.SSHClientConnection.create(SSHClientConnection.java:40)
at org.jclouds.sshj.SshjSshClient.acquire(SshjSshClient.java:191)
... 10 more
Caused by: net.schmizz.sshj.userauth.UserAuthException: keyboard-interactive auth not allowed by server
at net.schmizz.sshj.userauth.UserAuthImpl.authenticate(UserAuthImpl.java:81)
... 18 more
2 error[s]
at org.jclouds.compute.internal.BaseComputeService.createNodesInGroup(BaseComputeService.java:221)
at sun.reflect.NativeMethodAccessorImpl.invoke0(Native Method)
at sun.reflect.NativeMethodAccessorImpl.invoke(NativeMethodAccessorImpl.java:39)
at sun.reflect.DelegatingMethodAccessorImpl.invoke(DelegatingMethodAccessorImpl.java:25)
at java.lang.reflect.Method.invoke(Method.java:597)
at com.google.inject.internal.DelegatingInvocationHandler.invoke(DelegatingInvocationHandler.java:37)
at $Proxy77.createNodesInGroup(Unknown Source)
at org.jclouds.compute.internal.BaseComputeServiceLiveTest.testCreateTwoNodesWithRunScript(BaseComputeServiceLiveTest.java:339)
at sun.reflect.NativeMethodAccessorImpl.invoke0(Native Method)
at sun.reflect.NativeMethodAccessorImpl.invoke(NativeMethodAccessorImpl.java:39)
at sun.reflect.DelegatingMethodAccessorImpl.invoke(DelegatingMethodAccessorImpl.java:25)
at java.lang.reflect.Method.invoke(Method.java:597)
at org.testng.internal.MethodInvocationHelper.invokeMethod(MethodInvocationHelper.java:80)
at org.testng.internal.Invoker.invokeMethod(Invoker.java:702)
at org.testng.internal.Invoker.invokeTestMethod(Invoker.java:894)
at org.testng.internal.Invoker.invokeTestMethods(Invoker.java:1219)
at org.testng.internal.TestMethodWorker.invokeTestMethods(TestMethodWorker.java:127)
at org.testng.internal.TestMethodWorker.run(TestMethodWorker.java:111)
at org.testng.TestRunner.privateRun(TestRunner.java:768)
at org.testng.TestRunner.run(TestRunner.java:617)
at org.testng.SuiteRunner.runTest(SuiteRunner.java:334)
at org.testng.SuiteRunner.access$000(SuiteRunner.java:37)
at org.testng.SuiteRunner$SuiteWorker.run(SuiteRunner.java:368)
at org.testng.internal.thread.ThreadUtil$2.call(ThreadUtil.java:64)
at java.util.concurrent.FutureTask$Sync.innerRun(FutureTask.java:303)
at java.util.concurrent.FutureTask.run(FutureTask.java:138)
at java.util.concurrent.ThreadPoolExecutor$Worker.runTask(ThreadPoolExecutor.java:886)
at java.util.concurrent.ThreadPoolExecutor$Worker.run(ThreadPoolExecutor.java:908)
at java.lang.Thread.run(Thread.java:680)
Caused by: net.schmizz.sshj.userauth.UserAuthException: Exhausted available authentication methods
at net.schmizz.sshj.userauth.UserAuthImpl.authenticate(UserAuthImpl.java:114)
at net.schmizz.sshj.SSHClient.auth(SSHClient.java:205)
at net.schmizz.sshj.SSHClient.auth(SSHClient.java:190)
at net.schmizz.sshj.SSHClient.authPassword(SSHClient.java:266)
at net.schmizz.sshj.SSHClient.authPassword(SSHClient.java:236)
at net.schmizz.sshj.SSHClient.authPassword(SSHClient.java:220)
at org.jclouds.sshj.SSHClientConnection.create(SSHClientConnection.java:140)
at org.jclouds.sshj.SSHClientConnection.create(SSHClientConnection.java:40)
at org.jclouds.sshj.SshjSshClient.acquire(SshjSshClient.java:191)
... 10 more
Caused by: net.schmizz.sshj.userauth.UserAuthException: keyboard-interactive auth not allowed by server
at net.schmizz.sshj.userauth.UserAuthImpl.authenticate(UserAuthImpl.java:81)
... 18 more
2) AuthorizationException on node az-3.region-a.geo-1/212003:
org.jclouds.rest.AuthorizationException: (ubuntu:pw[aca5038b5a84f91323e16706c3ec745a]@15.185.226.221:22) (ubuntu:pw[aca5038b5a84f91323e16706c3ec745a]@15.185.226.221:22) error acquiring {hostAndPort=15.185.226.221:22, loginUser=ubuntu, ssh=null, connectTimeout=60000, sessionTimeout=60000} (out of retries - max 7): Exhausted available authentication methods
at org.jclouds.sshj.SshjSshClient.propagate(SshjSshClient.java:380)
at org.jclouds.sshj.SshjSshClient.acquire(SshjSshClient.java:201)
at org.jclouds.sshj.SshjSshClient.connect(SshjSshClient.java:221)
at org.jclouds.compute.callables.RunScriptOnNodeAsInitScriptUsingSsh.call(RunScriptOnNodeAsInitScriptUsingSsh.java:78)
at org.jclouds.compute.strategy.CustomizeNodeAndAddToGoodMapOrPutExceptionIntoBadMap.call(CustomizeNodeAndAddToGoodMapOrPutExceptionIntoBadMap.java:163)
at org.jclouds.compute.strategy.CustomizeNodeAndAddToGoodMapOrPutExceptionIntoBadMap.apply(CustomizeNodeAndAddToGoodMapOrPutExceptionIntoBadMap.java:184)
at org.jclouds.compute.strategy.CustomizeNodeAndAddToGoodMapOrPutExceptionIntoBadMap.apply(CustomizeNodeAndAddToGoodMapOrPutExceptionIntoBadMap.java:60)
at com.google.common.util.concurrent.Futures$3.apply(Futures.java:376)
at com.google.common.util.concurrent.Futures$ChainingListenableFuture.run(Futures.java:518)
at java.util.concurrent.ThreadPoolExecutor$Worker.runTask(ThreadPoolExecutor.java:886)
at java.util.concurrent.ThreadPoolExecutor$Worker.run(ThreadPoolExecutor.java:908)
at java.lang.Thread.run(Thread.java:680)
Caused by: net.schmizz.sshj.userauth.UserAuthException: Exhausted available authentication methods
at net.schmizz.sshj.userauth.UserAuthImpl.authenticate(UserAuthImpl.java:114)
at net.schmizz.sshj.SSHClient.auth(SSHClient.java:205)
at net.schmizz.sshj.SSHClient.auth(SSHClient.java:190)
at net.schmizz.sshj.SSHClient.authPassword(SSHClient.java:266)
at net.schmizz.sshj.SSHClient.authPassword(SSHClient.java:236)
at net.schmizz.sshj.SSHClient.authPassword(SSHClient.java:220)
at org.jclouds.sshj.SSHClientConnection.create(SSHClientConnection.java:140)
at org.jclouds.sshj.SSHClientConnection.create(SSHClientConnection.java:40)
at org.jclouds.sshj.SshjSshClient.acquire(SshjSshClient.java:191)
... 10 more
Caused by: net.schmizz.sshj.userauth.UserAuthException: keyboard-interactive auth not allowed by server
at net.schmizz.sshj.userauth.UserAuthImpl.authenticate(UserAuthImpl.java:81)
... 18 more
2 error[s]
at org.jclouds.compute.internal.BaseComputeService.createNodesInGroup(BaseComputeService.java:221)
at sun.reflect.NativeMethodAccessorImpl.invoke0(Native Method)
at sun.reflect.NativeMethodAccessorImpl.invoke(NativeMethodAccessorImpl.java:39)
at sun.reflect.DelegatingMethodAccessorImpl.invoke(DelegatingMethodAccessorImpl.java:25)
at java.lang.reflect.Method.invoke(Method.java:597)
at com.google.inject.internal.DelegatingInvocationHandler.invoke(DelegatingInvocationHandler.java:37)
at $Proxy77.createNodesInGroup(Unknown Source)
at org.jclouds.compute.internal.BaseComputeServiceLiveTest.testCreateTwoNodesWithRunScript(BaseComputeServiceLiveTest.java:339)
at sun.reflect.NativeMethodAccessorImpl.invoke0(Native Method)
at sun.reflect.NativeMethodAccessorImpl.invoke(NativeMethodAccessorImpl.java:39)
at sun.reflect.DelegatingMethodAccessorImpl.invoke(DelegatingMethodAccessorImpl.java:25)
at java.lang.reflect.Method.invoke(Method.java:597)
at org.testng.internal.MethodInvocationHelper.invokeMethod(MethodInvocationHelper.java:80)
at org.testng.internal.Invoker.invokeMethod(Invoker.java:702)
at org.testng.internal.Invoker.invokeTestMethod(Invoker.java:894)
at org.testng.internal.Invoker.invokeTestMethods(Invoker.java:1219)
at org.testng.internal.TestMethodWorker.invokeTestMethods(TestMethodWorker.java:127)
at org.testng.internal.TestMethodWorker.run(TestMethodWorker.java:111)
at org.testng.TestRunner.privateRun(TestRunner.java:768)
at org.testng.TestRunner.run(TestRunner.java:617)
at org.testng.SuiteRunner.runTest(SuiteRunner.java:334)
at org.testng.SuiteRunner.access$000(SuiteRunner.java:37)
at org.testng.SuiteRunner$SuiteWorker.run(SuiteRunner.java:368)
at org.testng.internal.thread.ThreadUtil$2.call(ThreadUtil.java:64)
at java.util.concurrent.FutureTask$Sync.innerRun(FutureTask.java:303)
at java.util.concurrent.FutureTask.run(FutureTask.java:138)
at java.util.concurrent.ThreadPoolExecutor$Worker.runTask(ThreadPoolExecutor.java:886)
at java.util.concurrent.ThreadPoolExecutor$Worker.run(ThreadPoolExecutor.java:908)
at java.lang.Thread.run(Thread.java:680)