blob: c37ce8a4a7bc3a460fcd3675368d06a6ec54193f [file] [log] [blame]
[INFO] Scanning for projects...
[WARNING]
[WARNING] Some problems were encountered while building the effective model for org.jclouds.provider:greenhousedata-element-vcloud:bundle:1.6.0-SNAPSHOT
[WARNING] 'parent.relativePath' of POM org.jclouds:jclouds-project:1.6.0-SNAPSHOT (/private/tmp/jclouds/project/pom.xml) points at org.jclouds:jclouds-multi instead of org.sonatype.oss:oss-parent, please verify your project structure @ org.jclouds:jclouds-project:1.6.0-SNAPSHOT, /private/tmp/jclouds/project/pom.xml, line 24, column 13
[WARNING]
[WARNING] It is highly recommended to fix these problems because they threaten the stability of your build.
[WARNING]
[WARNING] For this reason, future Maven versions might no longer support building such malformed projects.
[WARNING]
[INFO]
[INFO] ------------------------------------------------------------------------
[INFO] Building jclouds Green House Data Element vCloud provider 1.6.0-SNAPSHOT
[INFO] ------------------------------------------------------------------------
[INFO]
[INFO] --- maven-clean-plugin:2.4.1:clean (default-clean) @ greenhousedata-element-vcloud ---
[INFO]
[INFO] --- maven-enforcer-plugin:1.1.1:enforce (enforce-maven) @ greenhousedata-element-vcloud ---
[INFO]
[INFO] --- maven-enforcer-plugin:1.1.1:enforce (enforce-banned-dependencies) @ greenhousedata-element-vcloud ---
[INFO]
[INFO] --- maven-enforcer-plugin:1.1.1:enforce (enforce-java) @ greenhousedata-element-vcloud ---
[INFO]
[INFO] --- maven-remote-resources-plugin:1.4:process (process-remote-resources) @ greenhousedata-element-vcloud ---
[INFO]
[INFO] --- maven-resources-plugin:2.6:resources (default-resources) @ greenhousedata-element-vcloud ---
[INFO] Using 'UTF-8' encoding to copy filtered resources.
[INFO] skip non existing resourceDirectory /private/tmp/jclouds/providers/greenhousedata-element-vcloud/src/main/clojure
[INFO] Copying 1 resource
[INFO] Copying 2 resources
[INFO]
[INFO] --- maven-compiler-plugin:2.5.1:compile (default-compile) @ greenhousedata-element-vcloud ---
[INFO] Compiling 2 source files to /private/tmp/jclouds/providers/greenhousedata-element-vcloud/target/classes
[INFO]
[INFO] --- maven-resources-plugin:2.6:testResources (default-testResources) @ greenhousedata-element-vcloud ---
[INFO] Using 'UTF-8' encoding to copy filtered resources.
[INFO] skip non existing resourceDirectory /private/tmp/jclouds/providers/greenhousedata-element-vcloud/src/test/clojure
[INFO] Copying 1 resource
[INFO] Copying 2 resources
[INFO]
[INFO] --- maven-compiler-plugin:2.5.1:testCompile (default-testCompile) @ greenhousedata-element-vcloud ---
[INFO] Compiling 11 source files to /private/tmp/jclouds/providers/greenhousedata-element-vcloud/target/test-classes
[INFO]
[INFO] --- maven-surefire-plugin:2.12.4:test (default-test) @ greenhousedata-element-vcloud ---
[INFO] Surefire report directory: /private/tmp/jclouds/providers/greenhousedata-element-vcloud/target/surefire-reports
-------------------------------------------------------
T E S T S
-------------------------------------------------------
Running org.jclouds.greenhousedata.element.vcloud.GreenHouseDataElementVCloudProviderTest
Configuring TestNG with: org.apache.maven.surefire.testng.conf.TestNG652Configurator@4cbfea1d
Starting test testAllContains(org.jclouds.greenhousedata.element.vcloud.GreenHouseDataElementVCloudProviderTest)
Starting test testWithId(org.jclouds.greenhousedata.element.vcloud.GreenHouseDataElementVCloudProviderTest)
Starting test testOfApiContains(org.jclouds.greenhousedata.element.vcloud.GreenHouseDataElementVCloudProviderTest)
Starting test testTransformableToContains(org.jclouds.greenhousedata.element.vcloud.GreenHouseDataElementVCloudProviderTest)
[pool-1-thread-1] Test testAllContains(org.jclouds.greenhousedata.element.vcloud.GreenHouseDataElementVCloudProviderTest) succeeded: 10ms
Test suite progress: tests succeeded: 1, failed: 0, skipped: 0.
[pool-1-thread-2] Test testOfApiContains(org.jclouds.greenhousedata.element.vcloud.GreenHouseDataElementVCloudProviderTest) succeeded: 13ms
Test suite progress: tests succeeded: 2, failed: 0, skipped: 0.
[pool-1-thread-4] Test testWithId(org.jclouds.greenhousedata.element.vcloud.GreenHouseDataElementVCloudProviderTest) succeeded: 14ms
Test suite progress: tests succeeded: 3, failed: 0, skipped: 0.
[pool-1-thread-3] Test testTransformableToContains(org.jclouds.greenhousedata.element.vcloud.GreenHouseDataElementVCloudProviderTest) succeeded: 15ms
Test suite progress: tests succeeded: 4, failed: 0, skipped: 0.
Tests run: 4, Failures: 0, Errors: 0, Skipped: 0, Time elapsed: 0.477 sec
Results :
Tests run: 4, Failures: 0, Errors: 0, Skipped: 0
[INFO]
[INFO] --- maven-bundle-plugin:2.3.7:bundle (default-bundle) @ greenhousedata-element-vcloud ---
[INFO]
[INFO] --- maven-jar-plugin:2.4:test-jar (default) @ greenhousedata-element-vcloud ---
[INFO] Building jar: /private/tmp/jclouds/providers/greenhousedata-element-vcloud/target/greenhousedata-element-vcloud-1.6.0-SNAPSHOT-tests.jar
[INFO]
[INFO] --- maven-surefire-plugin:2.12.4:test (integration) @ greenhousedata-element-vcloud ---
[INFO] Surefire report directory: /private/tmp/jclouds/providers/greenhousedata-element-vcloud/target/surefire-reports
-------------------------------------------------------
T E S T S
-------------------------------------------------------
Running TestSuite
Configuring TestNG with: org.apache.maven.surefire.testng.conf.TestNG652Configurator@99b5393
Starting test testCompareSizes(org.jclouds.greenhousedata.element.vcloud.compute.GreenHouseDataElementVCloudTemplateBuilderLiveTest)
Starting test testListOrgs(org.jclouds.greenhousedata.element.vcloud.features.GreenHouseDataElementVCloudOrgClientLiveTest)
Starting test testFindCatalogIsWriteableIfNotVersion1_5(org.jclouds.greenhousedata.element.vcloud.features.GreenHouseDataElementVCloudCatalogClientLiveTest)
Starting test testGetVApp(org.jclouds.greenhousedata.element.vcloud.features.GreenHouseDataElementVCloudVAppClientLiveTest)
Starting test testCompareSizes(org.jclouds.greenhousedata.element.vcloud.compute.GreenHouseDataElementVCloudComputeServiceLiveTest)
[TestNG] Test testFindCatalogIsWriteableIfNotVersion1_5(org.jclouds.greenhousedata.element.vcloud.features.GreenHouseDataElementVCloudCatalogClientLiveTest) failed.
Test suite progress: tests succeeded: 0, failed: 1, skipped: 0.
Starting test testGetCatalog(org.jclouds.greenhousedata.element.vcloud.features.GreenHouseDataElementVCloudCatalogClientLiveTest)
[TestNG] Test testCompareSizes(org.jclouds.greenhousedata.element.vcloud.compute.GreenHouseDataElementVCloudComputeServiceLiveTest) failed.
Test suite progress: tests succeeded: 0, failed: 2, skipped: 0.
Starting test testCorrectExceptionRunningNodesNotFound(org.jclouds.greenhousedata.element.vcloud.compute.GreenHouseDataElementVCloudComputeServiceLiveTest)
[TestNG] Test testGetVApp(org.jclouds.greenhousedata.element.vcloud.features.GreenHouseDataElementVCloudVAppClientLiveTest) failed.
Test suite progress: tests succeeded: 0, failed: 3, skipped: 0.
[TestNG] Test testListOrgs(org.jclouds.greenhousedata.element.vcloud.features.GreenHouseDataElementVCloudOrgClientLiveTest) failed.
Test suite progress: tests succeeded: 0, failed: 4, skipped: 0.
[TestNG] Test testCompareSizes(org.jclouds.greenhousedata.element.vcloud.compute.GreenHouseDataElementVCloudTemplateBuilderLiveTest) failed.
Test suite progress: tests succeeded: 0, failed: 5, skipped: 0.
Starting test testFromTemplate(org.jclouds.greenhousedata.element.vcloud.compute.GreenHouseDataElementVCloudTemplateBuilderLiveTest)
Starting test testCaptureVApp(org.jclouds.greenhousedata.element.vcloud.features.GreenHouseDataElementVCloudVAppTemplateClientLiveTest)
Starting test testExtendedOptionsWithCustomizationScript(org.jclouds.greenhousedata.element.vcloud.features.GreenHouseDataElementVCloudVmClientLiveTest)
[TestNG] Test testGetCatalog(org.jclouds.greenhousedata.element.vcloud.features.GreenHouseDataElementVCloudCatalogClientLiveTest) failed.
Test suite progress: tests succeeded: 0, failed: 6, skipped: 0.
[TestNG] Test testCorrectExceptionRunningNodesNotFound(org.jclouds.greenhousedata.element.vcloud.compute.GreenHouseDataElementVCloudComputeServiceLiveTest) failed.
Test suite progress: tests succeeded: 0, failed: 7, skipped: 0.
Starting test testGetAssignableLocations(org.jclouds.greenhousedata.element.vcloud.compute.GreenHouseDataElementVCloudComputeServiceLiveTest)
[TestNG] Test testFromTemplate(org.jclouds.greenhousedata.element.vcloud.compute.GreenHouseDataElementVCloudTemplateBuilderLiveTest) failed.
Test suite progress: tests succeeded: 0, failed: 8, skipped: 0.
Starting test testGetAssignableLocations(org.jclouds.greenhousedata.element.vcloud.compute.GreenHouseDataElementVCloudTemplateBuilderLiveTest)
[TestNG] Test testCaptureVApp(org.jclouds.greenhousedata.element.vcloud.features.GreenHouseDataElementVCloudVAppTemplateClientLiveTest) failed.
Test suite progress: tests succeeded: 0, failed: 9, skipped: 0.
Starting test testFindVAppTemplate(org.jclouds.greenhousedata.element.vcloud.features.GreenHouseDataElementVCloudVAppTemplateClientLiveTest)
[TestNG] Test testExtendedOptionsWithCustomizationScript(org.jclouds.greenhousedata.element.vcloud.features.GreenHouseDataElementVCloudVmClientLiveTest) failed.
Test suite progress: tests succeeded: 0, failed: 10, skipped: 0.
Starting test testGetThumbnailOfVm(org.jclouds.greenhousedata.element.vcloud.features.GreenHouseDataElementVCloudVmClientLiveTest)
[TestNG] Test testGetAssignableLocations(org.jclouds.greenhousedata.element.vcloud.compute.GreenHouseDataElementVCloudComputeServiceLiveTest) failed.
Test suite progress: tests succeeded: 0, failed: 11, skipped: 0.
Starting test testImageById(org.jclouds.greenhousedata.element.vcloud.compute.GreenHouseDataElementVCloudComputeServiceLiveTest)
[TestNG] Test testGetAssignableLocations(org.jclouds.greenhousedata.element.vcloud.compute.GreenHouseDataElementVCloudTemplateBuilderLiveTest) failed.
Test suite progress: tests succeeded: 0, failed: 12, skipped: 0.
Starting test testTemplateBuilderCanFind(org.jclouds.greenhousedata.element.vcloud.compute.GreenHouseDataElementVCloudTemplateBuilderLiveTest)
[TestNG] Test testFindVAppTemplate(org.jclouds.greenhousedata.element.vcloud.features.GreenHouseDataElementVCloudVAppTemplateClientLiveTest) failed.
Test suite progress: tests succeeded: 0, failed: 13, skipped: 0.
Starting test testGetOvfEnvelopeForVAppTemplate(org.jclouds.greenhousedata.element.vcloud.features.GreenHouseDataElementVCloudVAppTemplateClientLiveTest)
[TestNG] Test testGetThumbnailOfVm(org.jclouds.greenhousedata.element.vcloud.features.GreenHouseDataElementVCloudVmClientLiveTest) failed.
Test suite progress: tests succeeded: 0, failed: 14, skipped: 0.
Starting test testGetVm(org.jclouds.greenhousedata.element.vcloud.features.GreenHouseDataElementVCloudVmClientLiveTest)
[TestNG] Test testImageById(org.jclouds.greenhousedata.element.vcloud.compute.GreenHouseDataElementVCloudComputeServiceLiveTest) failed.
Test suite progress: tests succeeded: 0, failed: 15, skipped: 0.
Starting test testImagesCache(org.jclouds.greenhousedata.element.vcloud.compute.GreenHouseDataElementVCloudComputeServiceLiveTest)
[TestNG] Test testTemplateBuilderCanFind(org.jclouds.greenhousedata.element.vcloud.compute.GreenHouseDataElementVCloudTemplateBuilderLiveTest) failed.
Test suite progress: tests succeeded: 0, failed: 16, skipped: 0.
Starting test testTemplateBuilderCanUseImageId(org.jclouds.greenhousedata.element.vcloud.compute.GreenHouseDataElementVCloudTemplateBuilderLiveTest)
[TestNG] Test testGetOvfEnvelopeForVAppTemplate(org.jclouds.greenhousedata.element.vcloud.features.GreenHouseDataElementVCloudVAppTemplateClientLiveTest) failed.
Test suite progress: tests succeeded: 0, failed: 17, skipped: 0.
Starting test testGetVAppTemplate(org.jclouds.greenhousedata.element.vcloud.features.GreenHouseDataElementVCloudVAppTemplateClientLiveTest)
[TestNG] Test testGetVm(org.jclouds.greenhousedata.element.vcloud.features.GreenHouseDataElementVCloudVmClientLiveTest) failed.
Test suite progress: tests succeeded: 0, failed: 18, skipped: 0.
[TestNG] Test testImagesCache(org.jclouds.greenhousedata.element.vcloud.compute.GreenHouseDataElementVCloudComputeServiceLiveTest) failed.
Test suite progress: tests succeeded: 0, failed: 19, skipped: 0.
Starting test testListImages(org.jclouds.greenhousedata.element.vcloud.compute.GreenHouseDataElementVCloudComputeServiceLiveTest)
[TestNG] Test testTemplateBuilderCanUseImageId(org.jclouds.greenhousedata.element.vcloud.compute.GreenHouseDataElementVCloudTemplateBuilderLiveTest) failed.
Test suite progress: tests succeeded: 0, failed: 20, skipped: 0.
Starting test testTemplateBuilderCannotFind(org.jclouds.greenhousedata.element.vcloud.compute.GreenHouseDataElementVCloudTemplateBuilderLiveTest)
[TestNG] Test testGetVAppTemplate(org.jclouds.greenhousedata.element.vcloud.features.GreenHouseDataElementVCloudVAppTemplateClientLiveTest) failed.
Test suite progress: tests succeeded: 0, failed: 21, skipped: 0.
[TestNG] Test testListImages(org.jclouds.greenhousedata.element.vcloud.compute.GreenHouseDataElementVCloudComputeServiceLiveTest) failed.
Test suite progress: tests succeeded: 0, failed: 22, skipped: 0.
Starting test testListSizes(org.jclouds.greenhousedata.element.vcloud.compute.GreenHouseDataElementVCloudComputeServiceLiveTest)
[TestNG] Test testTemplateBuilderCannotFind(org.jclouds.greenhousedata.element.vcloud.compute.GreenHouseDataElementVCloudTemplateBuilderLiveTest) failed.
Test suite progress: tests succeeded: 0, failed: 23, skipped: 0.
Starting test testTemplateBuilderCannotFind(org.jclouds.greenhousedata.element.vcloud.compute.GreenHouseDataElementVCloudTemplateBuilderLiveTest)
[TestNG] Test testListSizes(org.jclouds.greenhousedata.element.vcloud.compute.GreenHouseDataElementVCloudComputeServiceLiveTest) failed.
Test suite progress: tests succeeded: 0, failed: 24, skipped: 0.
Starting test setServiceDefaults(org.jclouds.greenhousedata.element.vcloud.compute.GreenHouseDataElementVCloudComputeServiceLiveTest)
[TestNG] Test setServiceDefaults(org.jclouds.greenhousedata.element.vcloud.compute.GreenHouseDataElementVCloudComputeServiceLiveTest) succeeded: 0ms
Test suite progress: tests succeeded: 1, failed: 24, skipped: 0.
Starting test testOptionToNotBlock(org.jclouds.greenhousedata.element.vcloud.compute.GreenHouseDataElementVCloudComputeServiceLiveTest)
[TestNG] Test testOptionToNotBlock(org.jclouds.greenhousedata.element.vcloud.compute.GreenHouseDataElementVCloudComputeServiceLiveTest) succeeded: 0ms
Test suite progress: tests succeeded: 2, failed: 24, skipped: 0.
Starting test testCreateAndRunAService(org.jclouds.greenhousedata.element.vcloud.compute.GreenHouseDataElementVCloudComputeServiceLiveTest)
[TestNG] Test testTemplateBuilderCannotFind(org.jclouds.greenhousedata.element.vcloud.compute.GreenHouseDataElementVCloudTemplateBuilderLiveTest) failed.
Test suite progress: tests succeeded: 2, failed: 25, skipped: 0.
Starting test testTemplateBuilderCannotFind(org.jclouds.greenhousedata.element.vcloud.compute.GreenHouseDataElementVCloudTemplateBuilderLiveTest)
[TestNG] Test testTemplateBuilderCannotFind(org.jclouds.greenhousedata.element.vcloud.compute.GreenHouseDataElementVCloudTemplateBuilderLiveTest) failed.
Test suite progress: tests succeeded: 2, failed: 26, skipped: 0.
Starting test testTemplateBuilderCannotFind(org.jclouds.greenhousedata.element.vcloud.compute.GreenHouseDataElementVCloudTemplateBuilderLiveTest)
[TestNG] Test testTemplateBuilderCannotFind(org.jclouds.greenhousedata.element.vcloud.compute.GreenHouseDataElementVCloudTemplateBuilderLiveTest) failed.
Test suite progress: tests succeeded: 2, failed: 27, skipped: 0.
Starting test testTemplateBuilderCannotFind(org.jclouds.greenhousedata.element.vcloud.compute.GreenHouseDataElementVCloudTemplateBuilderLiveTest)
[TestNG] Test testTemplateBuilderCannotFind(org.jclouds.greenhousedata.element.vcloud.compute.GreenHouseDataElementVCloudTemplateBuilderLiveTest) failed.
Test suite progress: tests succeeded: 2, failed: 28, skipped: 0.
Starting test testTemplateBuilderCannotFind(org.jclouds.greenhousedata.element.vcloud.compute.GreenHouseDataElementVCloudTemplateBuilderLiveTest)
[TestNG] Test testCreateAndRunAService(org.jclouds.greenhousedata.element.vcloud.compute.GreenHouseDataElementVCloudComputeServiceLiveTest) failed.
Test suite progress: tests succeeded: 2, failed: 29, skipped: 0.
Starting test testCorrectAuthException(org.jclouds.greenhousedata.element.vcloud.compute.GreenHouseDataElementVCloudComputeServiceLiveTest)
[TestNG] Test testTemplateBuilderCannotFind(org.jclouds.greenhousedata.element.vcloud.compute.GreenHouseDataElementVCloudTemplateBuilderLiveTest) failed.
Test suite progress: tests succeeded: 2, failed: 30, skipped: 0.
Starting test testTemplateBuilderCannotFind(org.jclouds.greenhousedata.element.vcloud.compute.GreenHouseDataElementVCloudTemplateBuilderLiveTest)
[TestNG] Test testCorrectAuthException(org.jclouds.greenhousedata.element.vcloud.compute.GreenHouseDataElementVCloudComputeServiceLiveTest) failed.
Test suite progress: tests succeeded: 2, failed: 31, skipped: 0.
[TestNG] Test testAScriptExecutionAfterBootWithBasicTemplate(org.jclouds.greenhousedata.element.vcloud.compute.GreenHouseDataElementVCloudComputeServiceLiveTest) skipped.
Test suite progress: tests succeeded: 2, failed: 31, skipped: 1.
[TestNG] Test testConcurrentUseOfComputeServiceToCreateNodes(org.jclouds.greenhousedata.element.vcloud.compute.GreenHouseDataElementVCloudComputeServiceLiveTest) skipped.
Test suite progress: tests succeeded: 2, failed: 31, skipped: 2.
[TestNG] Test testTemplateMatch(org.jclouds.greenhousedata.element.vcloud.compute.GreenHouseDataElementVCloudComputeServiceLiveTest) skipped.
Test suite progress: tests succeeded: 2, failed: 31, skipped: 3.
[TestNG] Test testCreateTwoNodesWithRunScript(org.jclouds.greenhousedata.element.vcloud.compute.GreenHouseDataElementVCloudComputeServiceLiveTest) skipped.
Test suite progress: tests succeeded: 2, failed: 31, skipped: 4.
[TestNG] Test testCreateAnotherNodeWithANewContextToEnsureSharedMemIsntRequired(org.jclouds.greenhousedata.element.vcloud.compute.GreenHouseDataElementVCloudComputeServiceLiveTest) skipped.
Test suite progress: tests succeeded: 2, failed: 31, skipped: 5.
[TestNG] Test testCredentialsCache(org.jclouds.greenhousedata.element.vcloud.compute.GreenHouseDataElementVCloudComputeServiceLiveTest) skipped.
Test suite progress: tests succeeded: 2, failed: 31, skipped: 6.
[TestNG] Test testGet(org.jclouds.greenhousedata.element.vcloud.compute.GreenHouseDataElementVCloudComputeServiceLiveTest) skipped.
Test suite progress: tests succeeded: 2, failed: 31, skipped: 7.
[TestNG] Test testReboot(org.jclouds.greenhousedata.element.vcloud.compute.GreenHouseDataElementVCloudComputeServiceLiveTest) skipped.
Test suite progress: tests succeeded: 2, failed: 31, skipped: 8.
[TestNG] Test testSuspendResume(org.jclouds.greenhousedata.element.vcloud.compute.GreenHouseDataElementVCloudComputeServiceLiveTest) skipped.
Test suite progress: tests succeeded: 2, failed: 31, skipped: 9.
[TestNG] Test testGetNodesWithDetails(org.jclouds.greenhousedata.element.vcloud.compute.GreenHouseDataElementVCloudComputeServiceLiveTest) skipped.
Test suite progress: tests succeeded: 2, failed: 31, skipped: 10.
[TestNG] Test testListNodes(org.jclouds.greenhousedata.element.vcloud.compute.GreenHouseDataElementVCloudComputeServiceLiveTest) skipped.
Test suite progress: tests succeeded: 2, failed: 31, skipped: 11.
[TestNG] Test testListNodesByIds(org.jclouds.greenhousedata.element.vcloud.compute.GreenHouseDataElementVCloudComputeServiceLiveTest) skipped.
Test suite progress: tests succeeded: 2, failed: 31, skipped: 12.
[TestNG] Test testDestroyNodes(org.jclouds.greenhousedata.element.vcloud.compute.GreenHouseDataElementVCloudComputeServiceLiveTest) skipped.
Test suite progress: tests succeeded: 2, failed: 31, skipped: 13.
[TestNG] Test testTemplateBuilderCannotFind(org.jclouds.greenhousedata.element.vcloud.compute.GreenHouseDataElementVCloudTemplateBuilderLiveTest) failed.
Test suite progress: tests succeeded: 2, failed: 32, skipped: 13.
Starting test testTemplateBuilderCannotFind(org.jclouds.greenhousedata.element.vcloud.compute.GreenHouseDataElementVCloudTemplateBuilderLiveTest)
[TestNG] Test testTemplateBuilderCannotFind(org.jclouds.greenhousedata.element.vcloud.compute.GreenHouseDataElementVCloudTemplateBuilderLiveTest) failed.
Test suite progress: tests succeeded: 2, failed: 33, skipped: 13.
Starting test testTemplateBuilderCannotFind(org.jclouds.greenhousedata.element.vcloud.compute.GreenHouseDataElementVCloudTemplateBuilderLiveTest)
[TestNG] Test testTemplateBuilderCannotFind(org.jclouds.greenhousedata.element.vcloud.compute.GreenHouseDataElementVCloudTemplateBuilderLiveTest) failed.
Test suite progress: tests succeeded: 2, failed: 34, skipped: 13.
Starting test testTemplateBuilderCannotFind(org.jclouds.greenhousedata.element.vcloud.compute.GreenHouseDataElementVCloudTemplateBuilderLiveTest)
[TestNG] Test testTemplateBuilderCannotFind(org.jclouds.greenhousedata.element.vcloud.compute.GreenHouseDataElementVCloudTemplateBuilderLiveTest) failed.
Test suite progress: tests succeeded: 2, failed: 35, skipped: 13.
Starting test testTemplateBuilderCannotFind(org.jclouds.greenhousedata.element.vcloud.compute.GreenHouseDataElementVCloudTemplateBuilderLiveTest)
[TestNG] Test testTemplateBuilderCannotFind(org.jclouds.greenhousedata.element.vcloud.compute.GreenHouseDataElementVCloudTemplateBuilderLiveTest) failed.
Test suite progress: tests succeeded: 2, failed: 36, skipped: 13.
Starting test testTemplateBuilderCannotFind(org.jclouds.greenhousedata.element.vcloud.compute.GreenHouseDataElementVCloudTemplateBuilderLiveTest)
[TestNG] Test testTemplateBuilderCannotFind(org.jclouds.greenhousedata.element.vcloud.compute.GreenHouseDataElementVCloudTemplateBuilderLiveTest) failed.
Test suite progress: tests succeeded: 2, failed: 37, skipped: 13.
Starting test testTemplateBuilderCannotFind(org.jclouds.greenhousedata.element.vcloud.compute.GreenHouseDataElementVCloudTemplateBuilderLiveTest)
[TestNG] Test testTemplateBuilderCannotFind(org.jclouds.greenhousedata.element.vcloud.compute.GreenHouseDataElementVCloudTemplateBuilderLiveTest) failed.
Test suite progress: tests succeeded: 2, failed: 38, skipped: 13.
Starting test testTemplateBuilderCannotFind(org.jclouds.greenhousedata.element.vcloud.compute.GreenHouseDataElementVCloudTemplateBuilderLiveTest)
[TestNG] Test testTemplateBuilderCannotFind(org.jclouds.greenhousedata.element.vcloud.compute.GreenHouseDataElementVCloudTemplateBuilderLiveTest) failed.
Test suite progress: tests succeeded: 2, failed: 39, skipped: 13.
Starting test testTemplateBuilderCannotFind(org.jclouds.greenhousedata.element.vcloud.compute.GreenHouseDataElementVCloudTemplateBuilderLiveTest)
[TestNG] Test testTemplateBuilderCannotFind(org.jclouds.greenhousedata.element.vcloud.compute.GreenHouseDataElementVCloudTemplateBuilderLiveTest) failed.
Test suite progress: tests succeeded: 2, failed: 40, skipped: 13.
Starting test testTemplateBuilderCannotFind(org.jclouds.greenhousedata.element.vcloud.compute.GreenHouseDataElementVCloudTemplateBuilderLiveTest)
[TestNG] Test testTemplateBuilderCannotFind(org.jclouds.greenhousedata.element.vcloud.compute.GreenHouseDataElementVCloudTemplateBuilderLiveTest) failed.
Test suite progress: tests succeeded: 2, failed: 41, skipped: 13.
Starting test testTemplateBuilderCannotFind(org.jclouds.greenhousedata.element.vcloud.compute.GreenHouseDataElementVCloudTemplateBuilderLiveTest)
[TestNG] Test testTemplateBuilderCannotFind(org.jclouds.greenhousedata.element.vcloud.compute.GreenHouseDataElementVCloudTemplateBuilderLiveTest) failed.
Test suite progress: tests succeeded: 2, failed: 42, skipped: 13.
Starting test testTemplateBuilderCannotFind(org.jclouds.greenhousedata.element.vcloud.compute.GreenHouseDataElementVCloudTemplateBuilderLiveTest)
[TestNG] Test testTemplateBuilderCannotFind(org.jclouds.greenhousedata.element.vcloud.compute.GreenHouseDataElementVCloudTemplateBuilderLiveTest) failed.
Test suite progress: tests succeeded: 2, failed: 43, skipped: 13.
Starting test testTemplateBuilderCannotFind(org.jclouds.greenhousedata.element.vcloud.compute.GreenHouseDataElementVCloudTemplateBuilderLiveTest)
[TestNG] Test testTemplateBuilderCannotFind(org.jclouds.greenhousedata.element.vcloud.compute.GreenHouseDataElementVCloudTemplateBuilderLiveTest) failed.
Test suite progress: tests succeeded: 2, failed: 44, skipped: 13.
Starting test testTemplateBuilderCannotFind(org.jclouds.greenhousedata.element.vcloud.compute.GreenHouseDataElementVCloudTemplateBuilderLiveTest)
[TestNG] Test testTemplateBuilderCannotFind(org.jclouds.greenhousedata.element.vcloud.compute.GreenHouseDataElementVCloudTemplateBuilderLiveTest) failed.
Test suite progress: tests succeeded: 2, failed: 45, skipped: 13.
Starting test testTemplateBuilderCannotFind(org.jclouds.greenhousedata.element.vcloud.compute.GreenHouseDataElementVCloudTemplateBuilderLiveTest)
[TestNG] Test testTemplateBuilderCannotFind(org.jclouds.greenhousedata.element.vcloud.compute.GreenHouseDataElementVCloudTemplateBuilderLiveTest) failed.
Test suite progress: tests succeeded: 2, failed: 46, skipped: 13.
Starting test testTemplateBuilderCannotFind(org.jclouds.greenhousedata.element.vcloud.compute.GreenHouseDataElementVCloudTemplateBuilderLiveTest)
[TestNG] Test testTemplateBuilderCannotFind(org.jclouds.greenhousedata.element.vcloud.compute.GreenHouseDataElementVCloudTemplateBuilderLiveTest) failed.
Test suite progress: tests succeeded: 2, failed: 47, skipped: 13.
Starting test testTemplateBuilderCannotFind(org.jclouds.greenhousedata.element.vcloud.compute.GreenHouseDataElementVCloudTemplateBuilderLiveTest)
[TestNG] Test testTemplateBuilderCannotFind(org.jclouds.greenhousedata.element.vcloud.compute.GreenHouseDataElementVCloudTemplateBuilderLiveTest) failed.
Test suite progress: tests succeeded: 2, failed: 48, skipped: 13.
Starting test testTemplateBuilderCannotFind(org.jclouds.greenhousedata.element.vcloud.compute.GreenHouseDataElementVCloudTemplateBuilderLiveTest)
[TestNG] Test testTemplateBuilderCannotFind(org.jclouds.greenhousedata.element.vcloud.compute.GreenHouseDataElementVCloudTemplateBuilderLiveTest) failed.
Test suite progress: tests succeeded: 2, failed: 49, skipped: 13.
Starting test testTemplateBuilderCannotFind(org.jclouds.greenhousedata.element.vcloud.compute.GreenHouseDataElementVCloudTemplateBuilderLiveTest)
[TestNG] Test testTemplateBuilderCannotFind(org.jclouds.greenhousedata.element.vcloud.compute.GreenHouseDataElementVCloudTemplateBuilderLiveTest) failed.
Test suite progress: tests succeeded: 2, failed: 50, skipped: 13.
Starting test testTemplateBuilderCannotFind(org.jclouds.greenhousedata.element.vcloud.compute.GreenHouseDataElementVCloudTemplateBuilderLiveTest)
[TestNG] Test testTemplateBuilderCannotFind(org.jclouds.greenhousedata.element.vcloud.compute.GreenHouseDataElementVCloudTemplateBuilderLiveTest) failed.
Test suite progress: tests succeeded: 2, failed: 51, skipped: 13.
Starting test testTemplateBuilderCannotFind(org.jclouds.greenhousedata.element.vcloud.compute.GreenHouseDataElementVCloudTemplateBuilderLiveTest)
[TestNG] Test testTemplateBuilderCannotFind(org.jclouds.greenhousedata.element.vcloud.compute.GreenHouseDataElementVCloudTemplateBuilderLiveTest) failed.
Test suite progress: tests succeeded: 2, failed: 52, skipped: 13.
Starting test testTemplateBuilderCannotFind(org.jclouds.greenhousedata.element.vcloud.compute.GreenHouseDataElementVCloudTemplateBuilderLiveTest)
[TestNG] Test testTemplateBuilderCannotFind(org.jclouds.greenhousedata.element.vcloud.compute.GreenHouseDataElementVCloudTemplateBuilderLiveTest) failed.
Test suite progress: tests succeeded: 2, failed: 53, skipped: 13.
Starting test testTemplateBuilderCannotFind(org.jclouds.greenhousedata.element.vcloud.compute.GreenHouseDataElementVCloudTemplateBuilderLiveTest)
[TestNG] Test testTemplateBuilderCannotFind(org.jclouds.greenhousedata.element.vcloud.compute.GreenHouseDataElementVCloudTemplateBuilderLiveTest) failed.
Test suite progress: tests succeeded: 2, failed: 54, skipped: 13.
Starting test testTemplateBuilderCannotFind(org.jclouds.greenhousedata.element.vcloud.compute.GreenHouseDataElementVCloudTemplateBuilderLiveTest)
[TestNG] Test testTemplateBuilderCannotFind(org.jclouds.greenhousedata.element.vcloud.compute.GreenHouseDataElementVCloudTemplateBuilderLiveTest) failed.
Test suite progress: tests succeeded: 2, failed: 55, skipped: 13.
Starting test testTemplateBuilderCannotFind(org.jclouds.greenhousedata.element.vcloud.compute.GreenHouseDataElementVCloudTemplateBuilderLiveTest)
[TestNG] Test testTemplateBuilderCannotFind(org.jclouds.greenhousedata.element.vcloud.compute.GreenHouseDataElementVCloudTemplateBuilderLiveTest) failed.
Test suite progress: tests succeeded: 2, failed: 56, skipped: 13.
Starting test testTemplateBuilderCannotFind(org.jclouds.greenhousedata.element.vcloud.compute.GreenHouseDataElementVCloudTemplateBuilderLiveTest)
[TestNG] Test testTemplateBuilderCannotFind(org.jclouds.greenhousedata.element.vcloud.compute.GreenHouseDataElementVCloudTemplateBuilderLiveTest) failed.
Test suite progress: tests succeeded: 2, failed: 57, skipped: 13.
Starting test testTemplateBuilderCannotFind(org.jclouds.greenhousedata.element.vcloud.compute.GreenHouseDataElementVCloudTemplateBuilderLiveTest)
[TestNG] Test testTemplateBuilderCannotFind(org.jclouds.greenhousedata.element.vcloud.compute.GreenHouseDataElementVCloudTemplateBuilderLiveTest) failed.
Test suite progress: tests succeeded: 2, failed: 58, skipped: 13.
Starting test testTemplateBuilderCannotFind(org.jclouds.greenhousedata.element.vcloud.compute.GreenHouseDataElementVCloudTemplateBuilderLiveTest)
[TestNG] Test testTemplateBuilderCannotFind(org.jclouds.greenhousedata.element.vcloud.compute.GreenHouseDataElementVCloudTemplateBuilderLiveTest) failed.
Test suite progress: tests succeeded: 2, failed: 59, skipped: 13.
Starting test testTemplateBuilderCannotFind(org.jclouds.greenhousedata.element.vcloud.compute.GreenHouseDataElementVCloudTemplateBuilderLiveTest)
[TestNG] Test testTemplateBuilderCannotFind(org.jclouds.greenhousedata.element.vcloud.compute.GreenHouseDataElementVCloudTemplateBuilderLiveTest) failed.
Test suite progress: tests succeeded: 2, failed: 60, skipped: 13.
Starting test testTemplateBuilderCannotFind(org.jclouds.greenhousedata.element.vcloud.compute.GreenHouseDataElementVCloudTemplateBuilderLiveTest)
[TestNG] Test testTemplateBuilderCannotFind(org.jclouds.greenhousedata.element.vcloud.compute.GreenHouseDataElementVCloudTemplateBuilderLiveTest) failed.
Test suite progress: tests succeeded: 2, failed: 61, skipped: 13.
Starting test testTemplateBuilderCannotFind(org.jclouds.greenhousedata.element.vcloud.compute.GreenHouseDataElementVCloudTemplateBuilderLiveTest)
[TestNG] Test testTemplateBuilderCannotFind(org.jclouds.greenhousedata.element.vcloud.compute.GreenHouseDataElementVCloudTemplateBuilderLiveTest) failed.
Test suite progress: tests succeeded: 2, failed: 62, skipped: 13.
Starting test testTemplateBuilderCannotFind(org.jclouds.greenhousedata.element.vcloud.compute.GreenHouseDataElementVCloudTemplateBuilderLiveTest)
[TestNG] Test testTemplateBuilderCannotFind(org.jclouds.greenhousedata.element.vcloud.compute.GreenHouseDataElementVCloudTemplateBuilderLiveTest) failed.
Test suite progress: tests succeeded: 2, failed: 63, skipped: 13.
Starting test testTemplateBuilderCannotFind(org.jclouds.greenhousedata.element.vcloud.compute.GreenHouseDataElementVCloudTemplateBuilderLiveTest)
[TestNG] Test testTemplateBuilderCannotFind(org.jclouds.greenhousedata.element.vcloud.compute.GreenHouseDataElementVCloudTemplateBuilderLiveTest) failed.
Test suite progress: tests succeeded: 2, failed: 64, skipped: 13.
Starting test testTemplateBuilderCannotFind(org.jclouds.greenhousedata.element.vcloud.compute.GreenHouseDataElementVCloudTemplateBuilderLiveTest)
[TestNG] Test testTemplateBuilderCannotFind(org.jclouds.greenhousedata.element.vcloud.compute.GreenHouseDataElementVCloudTemplateBuilderLiveTest) failed.
Test suite progress: tests succeeded: 2, failed: 65, skipped: 13.
Starting test testTemplateBuilderCannotFind(org.jclouds.greenhousedata.element.vcloud.compute.GreenHouseDataElementVCloudTemplateBuilderLiveTest)
[TestNG] Test testTemplateBuilderCannotFind(org.jclouds.greenhousedata.element.vcloud.compute.GreenHouseDataElementVCloudTemplateBuilderLiveTest) failed.
Test suite progress: tests succeeded: 2, failed: 66, skipped: 13.
Starting test testTemplateBuilderCannotFind(org.jclouds.greenhousedata.element.vcloud.compute.GreenHouseDataElementVCloudTemplateBuilderLiveTest)
[TestNG] Test testTemplateBuilderCannotFind(org.jclouds.greenhousedata.element.vcloud.compute.GreenHouseDataElementVCloudTemplateBuilderLiveTest) failed.
Test suite progress: tests succeeded: 2, failed: 67, skipped: 13.
Starting test testTemplateBuilderCannotFind(org.jclouds.greenhousedata.element.vcloud.compute.GreenHouseDataElementVCloudTemplateBuilderLiveTest)
[TestNG] Test testTemplateBuilderCannotFind(org.jclouds.greenhousedata.element.vcloud.compute.GreenHouseDataElementVCloudTemplateBuilderLiveTest) failed.
Test suite progress: tests succeeded: 2, failed: 68, skipped: 13.
Starting test testTemplateBuilderCannotFind(org.jclouds.greenhousedata.element.vcloud.compute.GreenHouseDataElementVCloudTemplateBuilderLiveTest)
[TestNG] Test testTemplateBuilderCannotFind(org.jclouds.greenhousedata.element.vcloud.compute.GreenHouseDataElementVCloudTemplateBuilderLiveTest) failed.
Test suite progress: tests succeeded: 2, failed: 69, skipped: 13.
Starting test testTemplateBuilderCannotFind(org.jclouds.greenhousedata.element.vcloud.compute.GreenHouseDataElementVCloudTemplateBuilderLiveTest)
[TestNG] Test testTemplateBuilderCannotFind(org.jclouds.greenhousedata.element.vcloud.compute.GreenHouseDataElementVCloudTemplateBuilderLiveTest) failed.
Test suite progress: tests succeeded: 2, failed: 70, skipped: 13.
Starting test testTemplateBuilderCannotFind(org.jclouds.greenhousedata.element.vcloud.compute.GreenHouseDataElementVCloudTemplateBuilderLiveTest)
[TestNG] Test testTemplateBuilderCannotFind(org.jclouds.greenhousedata.element.vcloud.compute.GreenHouseDataElementVCloudTemplateBuilderLiveTest) failed.
Test suite progress: tests succeeded: 2, failed: 71, skipped: 13.
Starting test testTemplateBuilderCannotFind(org.jclouds.greenhousedata.element.vcloud.compute.GreenHouseDataElementVCloudTemplateBuilderLiveTest)
[TestNG] Test testTemplateBuilderCannotFind(org.jclouds.greenhousedata.element.vcloud.compute.GreenHouseDataElementVCloudTemplateBuilderLiveTest) failed.
Test suite progress: tests succeeded: 2, failed: 72, skipped: 13.
Starting test testTemplateBuilderCannotFind(org.jclouds.greenhousedata.element.vcloud.compute.GreenHouseDataElementVCloudTemplateBuilderLiveTest)
[TestNG] Test testTemplateBuilderCannotFind(org.jclouds.greenhousedata.element.vcloud.compute.GreenHouseDataElementVCloudTemplateBuilderLiveTest) failed.
Test suite progress: tests succeeded: 2, failed: 73, skipped: 13.
Starting test testTemplateBuilderCannotFind(org.jclouds.greenhousedata.element.vcloud.compute.GreenHouseDataElementVCloudTemplateBuilderLiveTest)
[TestNG] Test testTemplateBuilderCannotFind(org.jclouds.greenhousedata.element.vcloud.compute.GreenHouseDataElementVCloudTemplateBuilderLiveTest) failed.
Test suite progress: tests succeeded: 2, failed: 74, skipped: 13.
Starting test testTemplateBuilderCannotFind(org.jclouds.greenhousedata.element.vcloud.compute.GreenHouseDataElementVCloudTemplateBuilderLiveTest)
[TestNG] Test testTemplateBuilderCannotFind(org.jclouds.greenhousedata.element.vcloud.compute.GreenHouseDataElementVCloudTemplateBuilderLiveTest) failed.
Test suite progress: tests succeeded: 2, failed: 75, skipped: 13.
Starting test testTemplateBuilderCannotFind(org.jclouds.greenhousedata.element.vcloud.compute.GreenHouseDataElementVCloudTemplateBuilderLiveTest)
[TestNG] Test testTemplateBuilderCannotFind(org.jclouds.greenhousedata.element.vcloud.compute.GreenHouseDataElementVCloudTemplateBuilderLiveTest) failed.
Test suite progress: tests succeeded: 2, failed: 76, skipped: 13.
Starting test testTemplateBuilderCannotFind(org.jclouds.greenhousedata.element.vcloud.compute.GreenHouseDataElementVCloudTemplateBuilderLiveTest)
[TestNG] Test testTemplateBuilderCannotFind(org.jclouds.greenhousedata.element.vcloud.compute.GreenHouseDataElementVCloudTemplateBuilderLiveTest) failed.
Test suite progress: tests succeeded: 2, failed: 77, skipped: 13.
Starting test testTemplateBuilderCannotFind(org.jclouds.greenhousedata.element.vcloud.compute.GreenHouseDataElementVCloudTemplateBuilderLiveTest)
[TestNG] Test testTemplateBuilderCannotFind(org.jclouds.greenhousedata.element.vcloud.compute.GreenHouseDataElementVCloudTemplateBuilderLiveTest) failed.
Test suite progress: tests succeeded: 2, failed: 78, skipped: 13.
Starting test testTemplateBuilderCannotFind(org.jclouds.greenhousedata.element.vcloud.compute.GreenHouseDataElementVCloudTemplateBuilderLiveTest)
[TestNG] Test testTemplateBuilderCannotFind(org.jclouds.greenhousedata.element.vcloud.compute.GreenHouseDataElementVCloudTemplateBuilderLiveTest) failed.
Test suite progress: tests succeeded: 2, failed: 79, skipped: 13.
Starting test testTemplateBuilderCannotFind(org.jclouds.greenhousedata.element.vcloud.compute.GreenHouseDataElementVCloudTemplateBuilderLiveTest)
[TestNG] Test testTemplateBuilderCannotFind(org.jclouds.greenhousedata.element.vcloud.compute.GreenHouseDataElementVCloudTemplateBuilderLiveTest) failed.
Test suite progress: tests succeeded: 2, failed: 80, skipped: 13.
Starting test testTemplateBuilderCannotFind(org.jclouds.greenhousedata.element.vcloud.compute.GreenHouseDataElementVCloudTemplateBuilderLiveTest)
[TestNG] Test testTemplateBuilderCannotFind(org.jclouds.greenhousedata.element.vcloud.compute.GreenHouseDataElementVCloudTemplateBuilderLiveTest) failed.
Test suite progress: tests succeeded: 2, failed: 81, skipped: 13.
Starting test testTemplateBuilderCannotFind(org.jclouds.greenhousedata.element.vcloud.compute.GreenHouseDataElementVCloudTemplateBuilderLiveTest)
[TestNG] Test testTemplateBuilderCannotFind(org.jclouds.greenhousedata.element.vcloud.compute.GreenHouseDataElementVCloudTemplateBuilderLiveTest) failed.
Test suite progress: tests succeeded: 2, failed: 82, skipped: 13.
Starting test testTemplateBuilderCannotFind(org.jclouds.greenhousedata.element.vcloud.compute.GreenHouseDataElementVCloudTemplateBuilderLiveTest)
[TestNG] Test testTemplateBuilderCannotFind(org.jclouds.greenhousedata.element.vcloud.compute.GreenHouseDataElementVCloudTemplateBuilderLiveTest) failed.
Test suite progress: tests succeeded: 2, failed: 83, skipped: 13.
Starting test testTemplateBuilderCannotFind(org.jclouds.greenhousedata.element.vcloud.compute.GreenHouseDataElementVCloudTemplateBuilderLiveTest)
[TestNG] Test testTemplateBuilderCannotFind(org.jclouds.greenhousedata.element.vcloud.compute.GreenHouseDataElementVCloudTemplateBuilderLiveTest) failed.
Test suite progress: tests succeeded: 2, failed: 84, skipped: 13.
Starting test testTemplateBuilderCannotFind(org.jclouds.greenhousedata.element.vcloud.compute.GreenHouseDataElementVCloudTemplateBuilderLiveTest)
[TestNG] Test testTemplateBuilderCannotFind(org.jclouds.greenhousedata.element.vcloud.compute.GreenHouseDataElementVCloudTemplateBuilderLiveTest) failed.
Test suite progress: tests succeeded: 2, failed: 85, skipped: 13.
Starting test testTemplateBuilderCannotFind(org.jclouds.greenhousedata.element.vcloud.compute.GreenHouseDataElementVCloudTemplateBuilderLiveTest)
[TestNG] Test testTemplateBuilderCannotFind(org.jclouds.greenhousedata.element.vcloud.compute.GreenHouseDataElementVCloudTemplateBuilderLiveTest) failed.
Test suite progress: tests succeeded: 2, failed: 86, skipped: 13.
Starting test testTemplateBuilderCannotFind(org.jclouds.greenhousedata.element.vcloud.compute.GreenHouseDataElementVCloudTemplateBuilderLiveTest)
[TestNG] Test testTemplateBuilderCannotFind(org.jclouds.greenhousedata.element.vcloud.compute.GreenHouseDataElementVCloudTemplateBuilderLiveTest) failed.
Test suite progress: tests succeeded: 2, failed: 87, skipped: 13.
Starting test testTemplateBuilderCannotFind(org.jclouds.greenhousedata.element.vcloud.compute.GreenHouseDataElementVCloudTemplateBuilderLiveTest)
[TestNG] Test testTemplateBuilderCannotFind(org.jclouds.greenhousedata.element.vcloud.compute.GreenHouseDataElementVCloudTemplateBuilderLiveTest) failed.
Test suite progress: tests succeeded: 2, failed: 88, skipped: 13.
Starting test testTemplateBuilderCannotFind(org.jclouds.greenhousedata.element.vcloud.compute.GreenHouseDataElementVCloudTemplateBuilderLiveTest)
[TestNG] Test testTemplateBuilderCannotFind(org.jclouds.greenhousedata.element.vcloud.compute.GreenHouseDataElementVCloudTemplateBuilderLiveTest) failed.
Test suite progress: tests succeeded: 2, failed: 89, skipped: 13.
Starting test testTemplateBuilderCannotFind(org.jclouds.greenhousedata.element.vcloud.compute.GreenHouseDataElementVCloudTemplateBuilderLiveTest)
[TestNG] Test testTemplateBuilderCannotFind(org.jclouds.greenhousedata.element.vcloud.compute.GreenHouseDataElementVCloudTemplateBuilderLiveTest) failed.
Test suite progress: tests succeeded: 2, failed: 90, skipped: 13.
Starting test testTemplateBuilderCannotFind(org.jclouds.greenhousedata.element.vcloud.compute.GreenHouseDataElementVCloudTemplateBuilderLiveTest)
[TestNG] Test testTemplateBuilderCannotFind(org.jclouds.greenhousedata.element.vcloud.compute.GreenHouseDataElementVCloudTemplateBuilderLiveTest) failed.
Test suite progress: tests succeeded: 2, failed: 91, skipped: 13.
Starting test testTemplateBuilderCannotFind(org.jclouds.greenhousedata.element.vcloud.compute.GreenHouseDataElementVCloudTemplateBuilderLiveTest)
[TestNG] Test testTemplateBuilderCannotFind(org.jclouds.greenhousedata.element.vcloud.compute.GreenHouseDataElementVCloudTemplateBuilderLiveTest) failed.
Test suite progress: tests succeeded: 2, failed: 92, skipped: 13.
Starting test testTemplateBuilderCannotFind(org.jclouds.greenhousedata.element.vcloud.compute.GreenHouseDataElementVCloudTemplateBuilderLiveTest)
[TestNG] Test testTemplateBuilderCannotFind(org.jclouds.greenhousedata.element.vcloud.compute.GreenHouseDataElementVCloudTemplateBuilderLiveTest) failed.
Test suite progress: tests succeeded: 2, failed: 93, skipped: 13.
Starting test testTemplateBuilderCannotFind(org.jclouds.greenhousedata.element.vcloud.compute.GreenHouseDataElementVCloudTemplateBuilderLiveTest)
[TestNG] Test testTemplateBuilderCannotFind(org.jclouds.greenhousedata.element.vcloud.compute.GreenHouseDataElementVCloudTemplateBuilderLiveTest) failed.
Test suite progress: tests succeeded: 2, failed: 94, skipped: 13.
Starting test testTemplateBuilderCannotFind(org.jclouds.greenhousedata.element.vcloud.compute.GreenHouseDataElementVCloudTemplateBuilderLiveTest)
[TestNG] Test testTemplateBuilderCannotFind(org.jclouds.greenhousedata.element.vcloud.compute.GreenHouseDataElementVCloudTemplateBuilderLiveTest) failed.
Test suite progress: tests succeeded: 2, failed: 95, skipped: 13.
Starting test testTemplateBuilderCannotFind(org.jclouds.greenhousedata.element.vcloud.compute.GreenHouseDataElementVCloudTemplateBuilderLiveTest)
[TestNG] Test testTemplateBuilderCannotFind(org.jclouds.greenhousedata.element.vcloud.compute.GreenHouseDataElementVCloudTemplateBuilderLiveTest) failed.
Test suite progress: tests succeeded: 2, failed: 96, skipped: 13.
Starting test testTemplateBuilderCannotFind(org.jclouds.greenhousedata.element.vcloud.compute.GreenHouseDataElementVCloudTemplateBuilderLiveTest)
[TestNG] Test testTemplateBuilderCannotFind(org.jclouds.greenhousedata.element.vcloud.compute.GreenHouseDataElementVCloudTemplateBuilderLiveTest) failed.
Test suite progress: tests succeeded: 2, failed: 97, skipped: 13.
Starting test testTemplateBuilderCannotFind(org.jclouds.greenhousedata.element.vcloud.compute.GreenHouseDataElementVCloudTemplateBuilderLiveTest)
[TestNG] Test testTemplateBuilderCannotFind(org.jclouds.greenhousedata.element.vcloud.compute.GreenHouseDataElementVCloudTemplateBuilderLiveTest) failed.
Test suite progress: tests succeeded: 2, failed: 98, skipped: 13.
Starting test testTemplateBuilderCannotFind(org.jclouds.greenhousedata.element.vcloud.compute.GreenHouseDataElementVCloudTemplateBuilderLiveTest)
[TestNG] Test testTemplateBuilderCannotFind(org.jclouds.greenhousedata.element.vcloud.compute.GreenHouseDataElementVCloudTemplateBuilderLiveTest) failed.
Test suite progress: tests succeeded: 2, failed: 99, skipped: 13.
Starting test testTemplateBuilderCannotFind(org.jclouds.greenhousedata.element.vcloud.compute.GreenHouseDataElementVCloudTemplateBuilderLiveTest)
[TestNG] Test testTemplateBuilderCannotFind(org.jclouds.greenhousedata.element.vcloud.compute.GreenHouseDataElementVCloudTemplateBuilderLiveTest) failed.
Test suite progress: tests succeeded: 2, failed: 100, skipped: 13.
Starting test testTemplateBuilderCannotFind(org.jclouds.greenhousedata.element.vcloud.compute.GreenHouseDataElementVCloudTemplateBuilderLiveTest)
[TestNG] Test testTemplateBuilderCannotFind(org.jclouds.greenhousedata.element.vcloud.compute.GreenHouseDataElementVCloudTemplateBuilderLiveTest) failed.
Test suite progress: tests succeeded: 2, failed: 101, skipped: 13.
Starting test testTemplateBuilderCannotFind(org.jclouds.greenhousedata.element.vcloud.compute.GreenHouseDataElementVCloudTemplateBuilderLiveTest)
[TestNG] Test testTemplateBuilderCannotFind(org.jclouds.greenhousedata.element.vcloud.compute.GreenHouseDataElementVCloudTemplateBuilderLiveTest) failed.
Test suite progress: tests succeeded: 2, failed: 102, skipped: 13.
Starting test testTemplateBuilderCannotFind(org.jclouds.greenhousedata.element.vcloud.compute.GreenHouseDataElementVCloudTemplateBuilderLiveTest)
[TestNG] Test testTemplateBuilderCannotFind(org.jclouds.greenhousedata.element.vcloud.compute.GreenHouseDataElementVCloudTemplateBuilderLiveTest) failed.
Test suite progress: tests succeeded: 2, failed: 103, skipped: 13.
Starting test testTemplateBuilderCannotFind(org.jclouds.greenhousedata.element.vcloud.compute.GreenHouseDataElementVCloudTemplateBuilderLiveTest)
[TestNG] Test testTemplateBuilderCannotFind(org.jclouds.greenhousedata.element.vcloud.compute.GreenHouseDataElementVCloudTemplateBuilderLiveTest) failed.
Test suite progress: tests succeeded: 2, failed: 104, skipped: 13.
Starting test testTemplateBuilderCannotFind(org.jclouds.greenhousedata.element.vcloud.compute.GreenHouseDataElementVCloudTemplateBuilderLiveTest)
[TestNG] Test testTemplateBuilderCannotFind(org.jclouds.greenhousedata.element.vcloud.compute.GreenHouseDataElementVCloudTemplateBuilderLiveTest) failed.
Test suite progress: tests succeeded: 2, failed: 105, skipped: 13.
Starting test testTemplateBuilderCannotFind(org.jclouds.greenhousedata.element.vcloud.compute.GreenHouseDataElementVCloudTemplateBuilderLiveTest)
[TestNG] Test testTemplateBuilderCannotFind(org.jclouds.greenhousedata.element.vcloud.compute.GreenHouseDataElementVCloudTemplateBuilderLiveTest) failed.
Test suite progress: tests succeeded: 2, failed: 106, skipped: 13.
Starting test testTemplateBuilderCannotFind(org.jclouds.greenhousedata.element.vcloud.compute.GreenHouseDataElementVCloudTemplateBuilderLiveTest)
[TestNG] Test testTemplateBuilderCannotFind(org.jclouds.greenhousedata.element.vcloud.compute.GreenHouseDataElementVCloudTemplateBuilderLiveTest) failed.
Test suite progress: tests succeeded: 2, failed: 107, skipped: 13.
Starting test testTemplateBuilderCannotFind(org.jclouds.greenhousedata.element.vcloud.compute.GreenHouseDataElementVCloudTemplateBuilderLiveTest)
[TestNG] Test testTemplateBuilderCannotFind(org.jclouds.greenhousedata.element.vcloud.compute.GreenHouseDataElementVCloudTemplateBuilderLiveTest) failed.
Test suite progress: tests succeeded: 2, failed: 108, skipped: 13.
Starting test testTemplateBuilderWithImageIdSpecified(org.jclouds.greenhousedata.element.vcloud.compute.GreenHouseDataElementVCloudTemplateBuilderLiveTest)
[TestNG] Test testTemplateBuilderWithImageIdSpecified(org.jclouds.greenhousedata.element.vcloud.compute.GreenHouseDataElementVCloudTemplateBuilderLiveTest) failed.
Test suite progress: tests succeeded: 2, failed: 109, skipped: 13.
Starting test testTemplateBuilderWithLoginUserSpecified(org.jclouds.greenhousedata.element.vcloud.compute.GreenHouseDataElementVCloudTemplateBuilderLiveTest)
[TestNG] Test testTemplateBuilderWithLoginUserSpecified(org.jclouds.greenhousedata.element.vcloud.compute.GreenHouseDataElementVCloudTemplateBuilderLiveTest) failed.
Test suite progress: tests succeeded: 2, failed: 110, skipped: 13.
Starting test testDefaultTemplateBuilder(org.jclouds.greenhousedata.element.vcloud.compute.GreenHouseDataElementVCloudTemplateBuilderLiveTest)
[TestNG] Test testDefaultTemplateBuilder(org.jclouds.greenhousedata.element.vcloud.compute.GreenHouseDataElementVCloudTemplateBuilderLiveTest) failed.
Test suite progress: tests succeeded: 2, failed: 111, skipped: 13.
Tests run: 126, Failures: 111, Errors: 0, Skipped: 13, Time elapsed: 165.59 sec <<< FAILURE!
testFindCatalogIsWriteableIfNotVersion1_5(org.jclouds.greenhousedata.element.vcloud.features.GreenHouseDataElementVCloudCatalogClientLiveTest) Time elapsed: 2.591 sec <<< FAILURE!
java.lang.IllegalStateException: version 1.0 not present in: {1.5=https://mycloud.greenhousedata.com/api/sessions, 5.1=https://mycloud.greenhousedata.com/api/sessions}
at com.google.common.base.Preconditions.checkState(Preconditions.java:149)
at org.jclouds.vcloud.config.VCloudRestClientModule$30.get(VCloudRestClientModule.java:402)
at org.jclouds.vcloud.config.VCloudRestClientModule$30.get(VCloudRestClientModule.java:396)
at org.jclouds.rest.internal.RestAnnotationProcessor.getEndpointFor(RestAnnotationProcessor.java:520)
at org.jclouds.rest.internal.RestAnnotationProcessor.findEndpoint(RestAnnotationProcessor.java:361)
at org.jclouds.rest.internal.RestAnnotationProcessor.apply(RestAnnotationProcessor.java:196)
at org.jclouds.rest.internal.RestAnnotationProcessor.apply(RestAnnotationProcessor.java:134)
at org.jclouds.rest.internal.InvokeSyncToAsyncHttpMethod.toCommand(InvokeSyncToAsyncHttpMethod.java:242)
at org.jclouds.rest.internal.InvokeSyncToAsyncHttpMethod.invoke(InvokeSyncToAsyncHttpMethod.java:127)
at org.jclouds.rest.internal.InvokeSyncToAsyncHttpMethod.apply(InvokeSyncToAsyncHttpMethod.java:99)
at org.jclouds.rest.internal.InvokeSyncToAsyncHttpMethod.apply(InvokeSyncToAsyncHttpMethod.java:60)
at org.jclouds.rest.internal.DelegatesToInvocationFunction.handle(DelegatesToInvocationFunction.java:159)
at org.jclouds.rest.internal.DelegatesToInvocationFunction.invoke(DelegatesToInvocationFunction.java:126)
at com.sun.proxy.$Proxy63.login(Unknown Source)
at org.jclouds.vcloud.config.VCloudRestClientModule$1.get(VCloudRestClientModule.java:160)
at org.jclouds.vcloud.config.VCloudRestClientModule$1.get(VCloudRestClientModule.java:156)
at org.jclouds.rest.suppliers.MemoizedRetryOnTimeOutButNotOnAuthorizationExceptionSupplier$SetAndThrowAuthorizationExceptionSupplierBackedLoader.load(MemoizedRetryOnTimeOutButNotOnAuthorizationExceptionSupplier.java:77)
at org.jclouds.rest.suppliers.MemoizedRetryOnTimeOutButNotOnAuthorizationExceptionSupplier$SetAndThrowAuthorizationExceptionSupplierBackedLoader.load(MemoizedRetryOnTimeOutButNotOnAuthorizationExceptionSupplier.java:61)
at com.google.common.cache.LocalCache$LoadingValueReference.loadFuture(LocalCache.java:3599)
at com.google.common.cache.LocalCache$Segment.loadSync(LocalCache.java:2379)
at com.google.common.cache.LocalCache$Segment.lockedGetOrLoad(LocalCache.java:2342)
at com.google.common.cache.LocalCache$Segment.get(LocalCache.java:2257)
at com.google.common.cache.LocalCache.get(LocalCache.java:4000)
at com.google.common.cache.LocalCache.getOrLoad(LocalCache.java:4004)
at com.google.common.cache.LocalCache$LocalLoadingCache.get(LocalCache.java:4874)
at org.jclouds.rest.suppliers.MemoizedRetryOnTimeOutButNotOnAuthorizationExceptionSupplier.get(MemoizedRetryOnTimeOutButNotOnAuthorizationExceptionSupplier.java:123)
at org.jclouds.vcloud.config.DefaultOrgForUser.get(DefaultOrgForUser.java:57)
at org.jclouds.vcloud.config.DefaultOrgForUser.get(DefaultOrgForUser.java:40)
at com.google.common.base.Suppliers$SupplierComposition.get(Suppliers.java:67)
at org.jclouds.vcloud.binders.OrgNameAndCatalogNameToEndpoint.bindToRequest(OrgNameAndCatalogNameToEndpoint.java:64)
at org.jclouds.rest.internal.RestAnnotationProcessor.apply(RestAnnotationProcessor.java:315)
at org.jclouds.rest.internal.RestAnnotationProcessor.apply(RestAnnotationProcessor.java:134)
at org.jclouds.rest.internal.InvokeSyncToAsyncHttpMethod.toCommand(InvokeSyncToAsyncHttpMethod.java:242)
at org.jclouds.rest.internal.InvokeSyncToAsyncHttpMethod.invoke(InvokeSyncToAsyncHttpMethod.java:127)
at org.jclouds.rest.internal.InvokeSyncToAsyncHttpMethod.apply(InvokeSyncToAsyncHttpMethod.java:99)
at org.jclouds.rest.internal.InvokeSyncToAsyncHttpMethod.apply(InvokeSyncToAsyncHttpMethod.java:60)
at org.jclouds.reflect.FunctionalReflection$FunctionalInvocationHandler.handleInvocation(FunctionalReflection.java:119)
at com.google.common.reflect.AbstractInvocationHandler.invoke(AbstractInvocationHandler.java:70)
at com.sun.proxy.$Proxy72.findCatalogInOrgNamed(Unknown Source)
at org.jclouds.vcloud.features.CatalogClientLiveTest.testFindCatalogIsWriteableIfNotVersion1_5(CatalogClientLiveTest.java:53)
at sun.reflect.NativeMethodAccessorImpl.invoke0(Native Method)
at sun.reflect.NativeMethodAccessorImpl.invoke(NativeMethodAccessorImpl.java:39)
at sun.reflect.DelegatingMethodAccessorImpl.invoke(DelegatingMethodAccessorImpl.java:25)
at java.lang.reflect.Method.invoke(Method.java:597)
at org.testng.internal.MethodInvocationHelper.invokeMethod(MethodInvocationHelper.java:80)
at org.testng.internal.Invoker.invokeMethod(Invoker.java:714)
at org.testng.internal.Invoker.invokeTestMethod(Invoker.java:901)
at org.testng.internal.Invoker.invokeTestMethods(Invoker.java:1231)
at org.testng.internal.TestMethodWorker.invokeTestMethods(TestMethodWorker.java:127)
at org.testng.internal.TestMethodWorker.run(TestMethodWorker.java:111)
at org.testng.TestRunner.privateRun(TestRunner.java:767)
at org.testng.TestRunner.run(TestRunner.java:617)
at org.testng.SuiteRunner.runTest(SuiteRunner.java:334)
at org.testng.SuiteRunner.access$000(SuiteRunner.java:37)
at org.testng.SuiteRunner$SuiteWorker.run(SuiteRunner.java:368)
at org.testng.internal.thread.ThreadUtil$2.call(ThreadUtil.java:64)
at java.util.concurrent.FutureTask$Sync.innerRun(FutureTask.java:303)
at java.util.concurrent.FutureTask.run(FutureTask.java:138)
at java.util.concurrent.ThreadPoolExecutor$Worker.runTask(ThreadPoolExecutor.java:895)
at java.util.concurrent.ThreadPoolExecutor$Worker.run(ThreadPoolExecutor.java:918)
at java.lang.Thread.run(Thread.java:680)
testCompareSizes(org.jclouds.greenhousedata.element.vcloud.compute.GreenHouseDataElementVCloudComputeServiceLiveTest) Time elapsed: 0.138 sec <<< FAILURE!
java.lang.IllegalStateException: version 1.0 not present in: {1.5=https://mycloud.greenhousedata.com/api/sessions, 5.1=https://mycloud.greenhousedata.com/api/sessions}
at com.google.common.base.Preconditions.checkState(Preconditions.java:149)
at org.jclouds.vcloud.config.VCloudRestClientModule$30.get(VCloudRestClientModule.java:402)
at org.jclouds.vcloud.config.VCloudRestClientModule$30.get(VCloudRestClientModule.java:396)
at org.jclouds.rest.internal.RestAnnotationProcessor.getEndpointFor(RestAnnotationProcessor.java:520)
at org.jclouds.rest.internal.RestAnnotationProcessor.findEndpoint(RestAnnotationProcessor.java:361)
at org.jclouds.rest.internal.RestAnnotationProcessor.apply(RestAnnotationProcessor.java:196)
at org.jclouds.rest.internal.RestAnnotationProcessor.apply(RestAnnotationProcessor.java:134)
at org.jclouds.rest.internal.InvokeSyncToAsyncHttpMethod.toCommand(InvokeSyncToAsyncHttpMethod.java:242)
at org.jclouds.rest.internal.InvokeSyncToAsyncHttpMethod.invoke(InvokeSyncToAsyncHttpMethod.java:127)
at org.jclouds.rest.internal.InvokeSyncToAsyncHttpMethod.apply(InvokeSyncToAsyncHttpMethod.java:99)
at org.jclouds.rest.internal.InvokeSyncToAsyncHttpMethod.apply(InvokeSyncToAsyncHttpMethod.java:60)
at org.jclouds.rest.internal.DelegatesToInvocationFunction.handle(DelegatesToInvocationFunction.java:159)
at org.jclouds.rest.internal.DelegatesToInvocationFunction.invoke(DelegatesToInvocationFunction.java:126)
at com.sun.proxy.$Proxy63.login(Unknown Source)
at org.jclouds.vcloud.config.VCloudRestClientModule$1.get(VCloudRestClientModule.java:160)
at org.jclouds.vcloud.config.VCloudRestClientModule$1.get(VCloudRestClientModule.java:156)
at org.jclouds.rest.suppliers.MemoizedRetryOnTimeOutButNotOnAuthorizationExceptionSupplier$SetAndThrowAuthorizationExceptionSupplierBackedLoader.load(MemoizedRetryOnTimeOutButNotOnAuthorizationExceptionSupplier.java:77)
at org.jclouds.rest.suppliers.MemoizedRetryOnTimeOutButNotOnAuthorizationExceptionSupplier$SetAndThrowAuthorizationExceptionSupplierBackedLoader.load(MemoizedRetryOnTimeOutButNotOnAuthorizationExceptionSupplier.java:61)
at com.google.common.cache.LocalCache$LoadingValueReference.loadFuture(LocalCache.java:3599)
at com.google.common.cache.LocalCache$Segment.loadSync(LocalCache.java:2379)
at com.google.common.cache.LocalCache$Segment.lockedGetOrLoad(LocalCache.java:2342)
at com.google.common.cache.LocalCache$Segment.get(LocalCache.java:2257)
at com.google.common.cache.LocalCache.get(LocalCache.java:4000)
at com.google.common.cache.LocalCache.getOrLoad(LocalCache.java:4004)
at com.google.common.cache.LocalCache$LocalLoadingCache.get(LocalCache.java:4874)
at org.jclouds.rest.suppliers.MemoizedRetryOnTimeOutButNotOnAuthorizationExceptionSupplier.get(MemoizedRetryOnTimeOutButNotOnAuthorizationExceptionSupplier.java:123)
at org.jclouds.vcloud.config.VCloudRestClientModule$OrgMapSupplier.get(VCloudRestClientModule.java:284)
at org.jclouds.vcloud.config.VCloudRestClientModule$OrgMapSupplier.get(VCloudRestClientModule.java:270)
at org.jclouds.rest.suppliers.MemoizedRetryOnTimeOutButNotOnAuthorizationExceptionSupplier$SetAndThrowAuthorizationExceptionSupplierBackedLoader.load(MemoizedRetryOnTimeOutButNotOnAuthorizationExceptionSupplier.java:77)
at org.jclouds.rest.suppliers.MemoizedRetryOnTimeOutButNotOnAuthorizationExceptionSupplier$SetAndThrowAuthorizationExceptionSupplierBackedLoader.load(MemoizedRetryOnTimeOutButNotOnAuthorizationExceptionSupplier.java:61)
at com.google.common.cache.LocalCache$LoadingValueReference.loadFuture(LocalCache.java:3599)
at com.google.common.cache.LocalCache$Segment.loadSync(LocalCache.java:2379)
at com.google.common.cache.LocalCache$Segment.lockedGetOrLoad(LocalCache.java:2342)
at com.google.common.cache.LocalCache$Segment.get(LocalCache.java:2257)
at com.google.common.cache.LocalCache.get(LocalCache.java:4000)
at com.google.common.cache.LocalCache.getOrLoad(LocalCache.java:4004)
at com.google.common.cache.LocalCache$LocalLoadingCache.get(LocalCache.java:4874)
at org.jclouds.rest.suppliers.MemoizedRetryOnTimeOutButNotOnAuthorizationExceptionSupplier.get(MemoizedRetryOnTimeOutButNotOnAuthorizationExceptionSupplier.java:123)
at org.jclouds.vcloud.suppliers.VAppTemplatesSupplier.get(VAppTemplatesSupplier.java:71)
at org.jclouds.vcloud.suppliers.VAppTemplatesSupplier.get(VAppTemplatesSupplier.java:49)
at org.jclouds.vcloud.compute.strategy.VCloudComputeServiceAdapter.supportedTemplates(VCloudComputeServiceAdapter.java:105)
at org.jclouds.vcloud.compute.strategy.VCloudComputeServiceAdapter.listImages(VCloudComputeServiceAdapter.java:131)
at org.jclouds.compute.config.ComputeServiceAdapterContextModule$2.get(ComputeServiceAdapterContextModule.java:127)
at org.jclouds.compute.config.ComputeServiceAdapterContextModule$2.get(ComputeServiceAdapterContextModule.java:124)
at org.jclouds.rest.suppliers.MemoizedRetryOnTimeOutButNotOnAuthorizationExceptionSupplier$SetAndThrowAuthorizationExceptionSupplierBackedLoader.load(MemoizedRetryOnTimeOutButNotOnAuthorizationExceptionSupplier.java:77)
at org.jclouds.rest.suppliers.MemoizedRetryOnTimeOutButNotOnAuthorizationExceptionSupplier$SetAndThrowAuthorizationExceptionSupplierBackedLoader.load(MemoizedRetryOnTimeOutButNotOnAuthorizationExceptionSupplier.java:61)
at com.google.common.cache.LocalCache$LoadingValueReference.loadFuture(LocalCache.java:3599)
at com.google.common.cache.LocalCache$Segment.loadSync(LocalCache.java:2379)
at com.google.common.cache.LocalCache$Segment.lockedGetOrLoad(LocalCache.java:2342)
at com.google.common.cache.LocalCache$Segment.get(LocalCache.java:2257)
at com.google.common.cache.LocalCache.get(LocalCache.java:4000)
at com.google.common.cache.LocalCache.getOrLoad(LocalCache.java:4004)
at com.google.common.cache.LocalCache$LocalLoadingCache.get(LocalCache.java:4874)
at org.jclouds.rest.suppliers.MemoizedRetryOnTimeOutButNotOnAuthorizationExceptionSupplier.get(MemoizedRetryOnTimeOutButNotOnAuthorizationExceptionSupplier.java:123)
at org.jclouds.compute.domain.internal.TemplateBuilderImpl.getImages(TemplateBuilderImpl.java:838)
at org.jclouds.compute.domain.internal.TemplateBuilderImpl.build(TemplateBuilderImpl.java:654)
at org.jclouds.compute.domain.internal.TemplateBuilderImpl.build(TemplateBuilderImpl.java:648)
at org.jclouds.compute.internal.BaseComputeServiceLiveTest.testCompareSizes(BaseComputeServiceLiveTest.java:803)
at sun.reflect.NativeMethodAccessorImpl.invoke0(Native Method)
at sun.reflect.NativeMethodAccessorImpl.invoke(NativeMethodAccessorImpl.java:39)
at sun.reflect.DelegatingMethodAccessorImpl.invoke(DelegatingMethodAccessorImpl.java:25)
at java.lang.reflect.Method.invoke(Method.java:597)
at org.testng.internal.MethodInvocationHelper.invokeMethod(MethodInvocationHelper.java:80)
at org.testng.internal.Invoker.invokeMethod(Invoker.java:714)
at org.testng.internal.Invoker.invokeTestMethod(Invoker.java:901)
at org.testng.internal.Invoker.invokeTestMethods(Invoker.java:1231)
at org.testng.internal.TestMethodWorker.invokeTestMethods(TestMethodWorker.java:127)
at org.testng.internal.TestMethodWorker.run(TestMethodWorker.java:111)
at org.testng.TestRunner.privateRun(TestRunner.java:767)
at org.testng.TestRunner.run(TestRunner.java:617)
at org.testng.SuiteRunner.runTest(SuiteRunner.java:334)
at org.testng.SuiteRunner.access$000(SuiteRunner.java:37)
at org.testng.SuiteRunner$SuiteWorker.run(SuiteRunner.java:368)
at org.testng.internal.thread.ThreadUtil$2.call(ThreadUtil.java:64)
at java.util.concurrent.FutureTask$Sync.innerRun(FutureTask.java:303)
at java.util.concurrent.FutureTask.run(FutureTask.java:138)
at java.util.concurrent.ThreadPoolExecutor$Worker.runTask(ThreadPoolExecutor.java:895)
at java.util.concurrent.ThreadPoolExecutor$Worker.run(ThreadPoolExecutor.java:918)
at java.lang.Thread.run(Thread.java:680)
testGetVApp(org.jclouds.greenhousedata.element.vcloud.features.GreenHouseDataElementVCloudVAppClientLiveTest) Time elapsed: 0.026 sec <<< FAILURE!
java.lang.IllegalStateException: version 1.0 not present in: {1.5=https://mycloud.greenhousedata.com/api/sessions, 5.1=https://mycloud.greenhousedata.com/api/sessions}
at com.google.common.base.Preconditions.checkState(Preconditions.java:149)
at org.jclouds.vcloud.config.VCloudRestClientModule$30.get(VCloudRestClientModule.java:402)
at org.jclouds.vcloud.config.VCloudRestClientModule$30.get(VCloudRestClientModule.java:396)
at org.jclouds.rest.internal.RestAnnotationProcessor.getEndpointFor(RestAnnotationProcessor.java:520)
at org.jclouds.rest.internal.RestAnnotationProcessor.findEndpoint(RestAnnotationProcessor.java:361)
at org.jclouds.rest.internal.RestAnnotationProcessor.apply(RestAnnotationProcessor.java:196)
at org.jclouds.rest.internal.RestAnnotationProcessor.apply(RestAnnotationProcessor.java:134)
at org.jclouds.rest.internal.InvokeSyncToAsyncHttpMethod.toCommand(InvokeSyncToAsyncHttpMethod.java:242)
at org.jclouds.rest.internal.InvokeSyncToAsyncHttpMethod.invoke(InvokeSyncToAsyncHttpMethod.java:127)
at org.jclouds.rest.internal.InvokeSyncToAsyncHttpMethod.apply(InvokeSyncToAsyncHttpMethod.java:99)
at org.jclouds.rest.internal.InvokeSyncToAsyncHttpMethod.apply(InvokeSyncToAsyncHttpMethod.java:60)
at org.jclouds.rest.internal.DelegatesToInvocationFunction.handle(DelegatesToInvocationFunction.java:159)
at org.jclouds.rest.internal.DelegatesToInvocationFunction.invoke(DelegatesToInvocationFunction.java:126)
at com.sun.proxy.$Proxy63.login(Unknown Source)
at org.jclouds.vcloud.config.VCloudRestClientModule$1.get(VCloudRestClientModule.java:160)
at org.jclouds.vcloud.config.VCloudRestClientModule$1.get(VCloudRestClientModule.java:156)
at org.jclouds.rest.suppliers.MemoizedRetryOnTimeOutButNotOnAuthorizationExceptionSupplier$SetAndThrowAuthorizationExceptionSupplierBackedLoader.load(MemoizedRetryOnTimeOutButNotOnAuthorizationExceptionSupplier.java:77)
at org.jclouds.rest.suppliers.MemoizedRetryOnTimeOutButNotOnAuthorizationExceptionSupplier$SetAndThrowAuthorizationExceptionSupplierBackedLoader.load(MemoizedRetryOnTimeOutButNotOnAuthorizationExceptionSupplier.java:61)
at com.google.common.cache.LocalCache$LoadingValueReference.loadFuture(LocalCache.java:3599)
at com.google.common.cache.LocalCache$Segment.loadSync(LocalCache.java:2379)
at com.google.common.cache.LocalCache$Segment.lockedGetOrLoad(LocalCache.java:2342)
at com.google.common.cache.LocalCache$Segment.get(LocalCache.java:2257)
at com.google.common.cache.LocalCache.get(LocalCache.java:4000)
at com.google.common.cache.LocalCache.getOrLoad(LocalCache.java:4004)
at com.google.common.cache.LocalCache$LocalLoadingCache.get(LocalCache.java:4874)
at org.jclouds.rest.suppliers.MemoizedRetryOnTimeOutButNotOnAuthorizationExceptionSupplier.get(MemoizedRetryOnTimeOutButNotOnAuthorizationExceptionSupplier.java:123)
at org.jclouds.vcloud.config.VCloudRestClientModule$OrgNameToOrgSupplier.get(VCloudRestClientModule.java:423)
at org.jclouds.vcloud.config.VCloudRestClientModule$OrgNameToOrgSupplier.get(VCloudRestClientModule.java:412)
at org.jclouds.rest.suppliers.MemoizedRetryOnTimeOutButNotOnAuthorizationExceptionSupplier$SetAndThrowAuthorizationExceptionSupplierBackedLoader.load(MemoizedRetryOnTimeOutButNotOnAuthorizationExceptionSupplier.java:77)
at org.jclouds.rest.suppliers.MemoizedRetryOnTimeOutButNotOnAuthorizationExceptionSupplier$SetAndThrowAuthorizationExceptionSupplierBackedLoader.load(MemoizedRetryOnTimeOutButNotOnAuthorizationExceptionSupplier.java:61)
at com.google.common.cache.LocalCache$LoadingValueReference.loadFuture(LocalCache.java:3599)
at com.google.common.cache.LocalCache$Segment.loadSync(LocalCache.java:2379)
at com.google.common.cache.LocalCache$Segment.lockedGetOrLoad(LocalCache.java:2342)
at com.google.common.cache.LocalCache$Segment.get(LocalCache.java:2257)
at com.google.common.cache.LocalCache.get(LocalCache.java:4000)
at com.google.common.cache.LocalCache.getOrLoad(LocalCache.java:4004)
at com.google.common.cache.LocalCache$LocalLoadingCache.get(LocalCache.java:4874)
at org.jclouds.rest.suppliers.MemoizedRetryOnTimeOutButNotOnAuthorizationExceptionSupplier.get(MemoizedRetryOnTimeOutButNotOnAuthorizationExceptionSupplier.java:123)
at org.jclouds.vcloud.functions.OrgNameToEndpoint.apply(OrgNameToEndpoint.java:52)
at org.jclouds.vcloud.functions.OrgNameToEndpoint.apply(OrgNameToEndpoint.java:38)
at org.jclouds.rest.internal.RestAnnotationProcessor.getEndpointInParametersOrNull(RestAnnotationProcessor.java:486)
at org.jclouds.rest.internal.RestAnnotationProcessor.getEndpointFor(RestAnnotationProcessor.java:509)
at org.jclouds.rest.internal.RestAnnotationProcessor.findEndpoint(RestAnnotationProcessor.java:361)
at org.jclouds.rest.internal.RestAnnotationProcessor.apply(RestAnnotationProcessor.java:194)
at org.jclouds.rest.internal.RestAnnotationProcessor.apply(RestAnnotationProcessor.java:134)
at org.jclouds.rest.internal.InvokeSyncToAsyncHttpMethod.toCommand(InvokeSyncToAsyncHttpMethod.java:242)
at org.jclouds.rest.internal.InvokeSyncToAsyncHttpMethod.invoke(InvokeSyncToAsyncHttpMethod.java:127)
at org.jclouds.rest.internal.InvokeSyncToAsyncHttpMethod.apply(InvokeSyncToAsyncHttpMethod.java:99)
at org.jclouds.rest.internal.InvokeSyncToAsyncHttpMethod.apply(InvokeSyncToAsyncHttpMethod.java:60)
at org.jclouds.reflect.FunctionalReflection$FunctionalInvocationHandler.handleInvocation(FunctionalReflection.java:119)
at com.google.common.reflect.AbstractInvocationHandler.invoke(AbstractInvocationHandler.java:70)
at com.sun.proxy.$Proxy71.findOrgNamed(Unknown Source)
at org.jclouds.vcloud.features.VAppClientLiveTest.testGetVApp(VAppClientLiveTest.java:40)
at sun.reflect.NativeMethodAccessorImpl.invoke0(Native Method)
at sun.reflect.NativeMethodAccessorImpl.invoke(NativeMethodAccessorImpl.java:39)
at sun.reflect.DelegatingMethodAccessorImpl.invoke(DelegatingMethodAccessorImpl.java:25)
at java.lang.reflect.Method.invoke(Method.java:597)
at org.testng.internal.MethodInvocationHelper.invokeMethod(MethodInvocationHelper.java:80)
at org.testng.internal.Invoker.invokeMethod(Invoker.java:714)
at org.testng.internal.Invoker.invokeTestMethod(Invoker.java:901)
at org.testng.internal.Invoker.invokeTestMethods(Invoker.java:1231)
at org.testng.internal.TestMethodWorker.invokeTestMethods(TestMethodWorker.java:127)
at org.testng.internal.TestMethodWorker.run(TestMethodWorker.java:111)
at org.testng.TestRunner.privateRun(TestRunner.java:767)
at org.testng.TestRunner.run(TestRunner.java:617)
at org.testng.SuiteRunner.runTest(SuiteRunner.java:334)
at org.testng.SuiteRunner.access$000(SuiteRunner.java:37)
at org.testng.SuiteRunner$SuiteWorker.run(SuiteRunner.java:368)
at org.testng.internal.thread.ThreadUtil$2.call(ThreadUtil.java:64)
at java.util.concurrent.FutureTask$Sync.innerRun(FutureTask.java:303)
at java.util.concurrent.FutureTask.run(FutureTask.java:138)
at java.util.concurrent.ThreadPoolExecutor$Worker.runTask(ThreadPoolExecutor.java:895)
at java.util.concurrent.ThreadPoolExecutor$Worker.run(ThreadPoolExecutor.java:918)
at java.lang.Thread.run(Thread.java:680)
testListOrgs(org.jclouds.greenhousedata.element.vcloud.features.GreenHouseDataElementVCloudOrgClientLiveTest) Time elapsed: 0.03 sec <<< FAILURE!
java.lang.IllegalStateException: version 1.0 not present in: {1.5=https://mycloud.greenhousedata.com/api/sessions, 5.1=https://mycloud.greenhousedata.com/api/sessions}
at com.google.common.base.Preconditions.checkState(Preconditions.java:149)
at org.jclouds.vcloud.config.VCloudRestClientModule$30.get(VCloudRestClientModule.java:402)
at org.jclouds.vcloud.config.VCloudRestClientModule$30.get(VCloudRestClientModule.java:396)
at org.jclouds.rest.internal.RestAnnotationProcessor.getEndpointFor(RestAnnotationProcessor.java:520)
at org.jclouds.rest.internal.RestAnnotationProcessor.findEndpoint(RestAnnotationProcessor.java:361)
at org.jclouds.rest.internal.RestAnnotationProcessor.apply(RestAnnotationProcessor.java:196)
at org.jclouds.rest.internal.RestAnnotationProcessor.apply(RestAnnotationProcessor.java:134)
at org.jclouds.rest.internal.InvokeSyncToAsyncHttpMethod.toCommand(InvokeSyncToAsyncHttpMethod.java:242)
at org.jclouds.rest.internal.InvokeSyncToAsyncHttpMethod.invoke(InvokeSyncToAsyncHttpMethod.java:127)
at org.jclouds.rest.internal.InvokeSyncToAsyncHttpMethod.apply(InvokeSyncToAsyncHttpMethod.java:99)
at org.jclouds.rest.internal.InvokeSyncToAsyncHttpMethod.apply(InvokeSyncToAsyncHttpMethod.java:60)
at org.jclouds.rest.internal.DelegatesToInvocationFunction.handle(DelegatesToInvocationFunction.java:159)
at org.jclouds.rest.internal.DelegatesToInvocationFunction.invoke(DelegatesToInvocationFunction.java:126)
at com.sun.proxy.$Proxy63.login(Unknown Source)
at org.jclouds.vcloud.config.VCloudRestClientModule$1.get(VCloudRestClientModule.java:160)
at org.jclouds.vcloud.config.VCloudRestClientModule$1.get(VCloudRestClientModule.java:156)
at org.jclouds.rest.suppliers.MemoizedRetryOnTimeOutButNotOnAuthorizationExceptionSupplier$SetAndThrowAuthorizationExceptionSupplierBackedLoader.load(MemoizedRetryOnTimeOutButNotOnAuthorizationExceptionSupplier.java:77)
at org.jclouds.rest.suppliers.MemoizedRetryOnTimeOutButNotOnAuthorizationExceptionSupplier$SetAndThrowAuthorizationExceptionSupplierBackedLoader.load(MemoizedRetryOnTimeOutButNotOnAuthorizationExceptionSupplier.java:61)
at com.google.common.cache.LocalCache$LoadingValueReference.loadFuture(LocalCache.java:3599)
at com.google.common.cache.LocalCache$Segment.loadSync(LocalCache.java:2379)
at com.google.common.cache.LocalCache$Segment.lockedGetOrLoad(LocalCache.java:2342)
at com.google.common.cache.LocalCache$Segment.get(LocalCache.java:2257)
at com.google.common.cache.LocalCache.get(LocalCache.java:4000)
at com.google.common.cache.LocalCache.getOrLoad(LocalCache.java:4004)
at com.google.common.cache.LocalCache$LocalLoadingCache.get(LocalCache.java:4874)
at org.jclouds.rest.suppliers.MemoizedRetryOnTimeOutButNotOnAuthorizationExceptionSupplier.get(MemoizedRetryOnTimeOutButNotOnAuthorizationExceptionSupplier.java:123)
at com.google.common.base.Suppliers$SupplierComposition.get(Suppliers.java:67)
at org.jclouds.rest.internal.RestAnnotationProcessor.getEndpointFor(RestAnnotationProcessor.java:520)
at org.jclouds.rest.internal.RestAnnotationProcessor.findEndpoint(RestAnnotationProcessor.java:361)
at org.jclouds.rest.internal.RestAnnotationProcessor.apply(RestAnnotationProcessor.java:194)
at org.jclouds.rest.internal.RestAnnotationProcessor.apply(RestAnnotationProcessor.java:134)
at org.jclouds.rest.internal.InvokeSyncToAsyncHttpMethod.toCommand(InvokeSyncToAsyncHttpMethod.java:242)
at org.jclouds.rest.internal.InvokeSyncToAsyncHttpMethod.invoke(InvokeSyncToAsyncHttpMethod.java:127)
at org.jclouds.rest.internal.InvokeSyncToAsyncHttpMethod.apply(InvokeSyncToAsyncHttpMethod.java:99)
at org.jclouds.rest.internal.InvokeSyncToAsyncHttpMethod.apply(InvokeSyncToAsyncHttpMethod.java:60)
at org.jclouds.reflect.FunctionalReflection$FunctionalInvocationHandler.handleInvocation(FunctionalReflection.java:119)
at com.google.common.reflect.AbstractInvocationHandler.invoke(AbstractInvocationHandler.java:70)
at com.sun.proxy.$Proxy71.listOrgs(Unknown Source)
at org.jclouds.vcloud.features.OrgClientLiveTest.testListOrgs(OrgClientLiveTest.java:36)
at sun.reflect.NativeMethodAccessorImpl.invoke0(Native Method)
at sun.reflect.NativeMethodAccessorImpl.invoke(NativeMethodAccessorImpl.java:39)
at sun.reflect.DelegatingMethodAccessorImpl.invoke(DelegatingMethodAccessorImpl.java:25)
at java.lang.reflect.Method.invoke(Method.java:597)
at org.testng.internal.MethodInvocationHelper.invokeMethod(MethodInvocationHelper.java:80)
at org.testng.internal.Invoker.invokeMethod(Invoker.java:714)
at org.testng.internal.Invoker.invokeTestMethod(Invoker.java:901)
at org.testng.internal.Invoker.invokeTestMethods(Invoker.java:1231)
at org.testng.internal.TestMethodWorker.invokeTestMethods(TestMethodWorker.java:127)
at org.testng.internal.TestMethodWorker.run(TestMethodWorker.java:111)
at org.testng.TestRunner.privateRun(TestRunner.java:767)
at org.testng.TestRunner.run(TestRunner.java:617)
at org.testng.SuiteRunner.runTest(SuiteRunner.java:334)
at org.testng.SuiteRunner.access$000(SuiteRunner.java:37)
at org.testng.SuiteRunner$SuiteWorker.run(SuiteRunner.java:368)
at org.testng.internal.thread.ThreadUtil$2.call(ThreadUtil.java:64)
at java.util.concurrent.FutureTask$Sync.innerRun(FutureTask.java:303)
at java.util.concurrent.FutureTask.run(FutureTask.java:138)
at java.util.concurrent.ThreadPoolExecutor$Worker.runTask(ThreadPoolExecutor.java:895)
at java.util.concurrent.ThreadPoolExecutor$Worker.run(ThreadPoolExecutor.java:918)
at java.lang.Thread.run(Thread.java:680)
testCompareSizes(org.jclouds.greenhousedata.element.vcloud.compute.GreenHouseDataElementVCloudTemplateBuilderLiveTest) Time elapsed: 0.031 sec <<< FAILURE!
java.lang.IllegalStateException: version 1.0 not present in: {1.5=https://mycloud.greenhousedata.com/api/sessions, 5.1=https://mycloud.greenhousedata.com/api/sessions}
at com.google.common.base.Preconditions.checkState(Preconditions.java:149)
at org.jclouds.vcloud.config.VCloudRestClientModule$30.get(VCloudRestClientModule.java:402)
at org.jclouds.vcloud.config.VCloudRestClientModule$30.get(VCloudRestClientModule.java:396)
at org.jclouds.rest.internal.RestAnnotationProcessor.getEndpointFor(RestAnnotationProcessor.java:520)
at org.jclouds.rest.internal.RestAnnotationProcessor.findEndpoint(RestAnnotationProcessor.java:361)
at org.jclouds.rest.internal.RestAnnotationProcessor.apply(RestAnnotationProcessor.java:196)
at org.jclouds.rest.internal.RestAnnotationProcessor.apply(RestAnnotationProcessor.java:134)
at org.jclouds.rest.internal.InvokeSyncToAsyncHttpMethod.toCommand(InvokeSyncToAsyncHttpMethod.java:242)
at org.jclouds.rest.internal.InvokeSyncToAsyncHttpMethod.invoke(InvokeSyncToAsyncHttpMethod.java:127)
at org.jclouds.rest.internal.InvokeSyncToAsyncHttpMethod.apply(InvokeSyncToAsyncHttpMethod.java:99)
at org.jclouds.rest.internal.InvokeSyncToAsyncHttpMethod.apply(InvokeSyncToAsyncHttpMethod.java:60)
at org.jclouds.rest.internal.DelegatesToInvocationFunction.handle(DelegatesToInvocationFunction.java:159)
at org.jclouds.rest.internal.DelegatesToInvocationFunction.invoke(DelegatesToInvocationFunction.java:126)
at com.sun.proxy.$Proxy63.login(Unknown Source)
at org.jclouds.vcloud.config.VCloudRestClientModule$1.get(VCloudRestClientModule.java:160)
at org.jclouds.vcloud.config.VCloudRestClientModule$1.get(VCloudRestClientModule.java:156)
at org.jclouds.rest.suppliers.MemoizedRetryOnTimeOutButNotOnAuthorizationExceptionSupplier$SetAndThrowAuthorizationExceptionSupplierBackedLoader.load(MemoizedRetryOnTimeOutButNotOnAuthorizationExceptionSupplier.java:77)
at org.jclouds.rest.suppliers.MemoizedRetryOnTimeOutButNotOnAuthorizationExceptionSupplier$SetAndThrowAuthorizationExceptionSupplierBackedLoader.load(MemoizedRetryOnTimeOutButNotOnAuthorizationExceptionSupplier.java:61)
at com.google.common.cache.LocalCache$LoadingValueReference.loadFuture(LocalCache.java:3599)
at com.google.common.cache.LocalCache$Segment.loadSync(LocalCache.java:2379)
at com.google.common.cache.LocalCache$Segment.lockedGetOrLoad(LocalCache.java:2342)
at com.google.common.cache.LocalCache$Segment.get(LocalCache.java:2257)
at com.google.common.cache.LocalCache.get(LocalCache.java:4000)
at com.google.common.cache.LocalCache.getOrLoad(LocalCache.java:4004)
at com.google.common.cache.LocalCache$LocalLoadingCache.get(LocalCache.java:4874)
at org.jclouds.rest.suppliers.MemoizedRetryOnTimeOutButNotOnAuthorizationExceptionSupplier.get(MemoizedRetryOnTimeOutButNotOnAuthorizationExceptionSupplier.java:123)
at org.jclouds.vcloud.config.VCloudRestClientModule$OrgMapSupplier.get(VCloudRestClientModule.java:284)
at org.jclouds.vcloud.config.VCloudRestClientModule$OrgMapSupplier.get(VCloudRestClientModule.java:270)
at org.jclouds.rest.suppliers.MemoizedRetryOnTimeOutButNotOnAuthorizationExceptionSupplier$SetAndThrowAuthorizationExceptionSupplierBackedLoader.load(MemoizedRetryOnTimeOutButNotOnAuthorizationExceptionSupplier.java:77)
at org.jclouds.rest.suppliers.MemoizedRetryOnTimeOutButNotOnAuthorizationExceptionSupplier$SetAndThrowAuthorizationExceptionSupplierBackedLoader.load(MemoizedRetryOnTimeOutButNotOnAuthorizationExceptionSupplier.java:61)
at com.google.common.cache.LocalCache$LoadingValueReference.loadFuture(LocalCache.java:3599)
at com.google.common.cache.LocalCache$Segment.loadSync(LocalCache.java:2379)
at com.google.common.cache.LocalCache$Segment.lockedGetOrLoad(LocalCache.java:2342)
at com.google.common.cache.LocalCache$Segment.get(LocalCache.java:2257)
at com.google.common.cache.LocalCache.get(LocalCache.java:4000)
at com.google.common.cache.LocalCache.getOrLoad(LocalCache.java:4004)
at com.google.common.cache.LocalCache$LocalLoadingCache.get(LocalCache.java:4874)
at org.jclouds.rest.suppliers.MemoizedRetryOnTimeOutButNotOnAuthorizationExceptionSupplier.get(MemoizedRetryOnTimeOutButNotOnAuthorizationExceptionSupplier.java:123)
at org.jclouds.vcloud.suppliers.VAppTemplatesSupplier.get(VAppTemplatesSupplier.java:71)
at org.jclouds.vcloud.suppliers.VAppTemplatesSupplier.get(VAppTemplatesSupplier.java:49)
at org.jclouds.vcloud.compute.strategy.VCloudComputeServiceAdapter.supportedTemplates(VCloudComputeServiceAdapter.java:105)
at org.jclouds.vcloud.compute.strategy.VCloudComputeServiceAdapter.listImages(VCloudComputeServiceAdapter.java:131)
at org.jclouds.compute.config.ComputeServiceAdapterContextModule$2.get(ComputeServiceAdapterContextModule.java:127)
at org.jclouds.compute.config.ComputeServiceAdapterContextModule$2.get(ComputeServiceAdapterContextModule.java:124)
at org.jclouds.rest.suppliers.MemoizedRetryOnTimeOutButNotOnAuthorizationExceptionSupplier$SetAndThrowAuthorizationExceptionSupplierBackedLoader.load(MemoizedRetryOnTimeOutButNotOnAuthorizationExceptionSupplier.java:77)
at org.jclouds.rest.suppliers.MemoizedRetryOnTimeOutButNotOnAuthorizationExceptionSupplier$SetAndThrowAuthorizationExceptionSupplierBackedLoader.load(MemoizedRetryOnTimeOutButNotOnAuthorizationExceptionSupplier.java:61)
at com.google.common.cache.LocalCache$LoadingValueReference.loadFuture(LocalCache.java:3599)
at com.google.common.cache.LocalCache$Segment.loadSync(LocalCache.java:2379)
at com.google.common.cache.LocalCache$Segment.lockedGetOrLoad(LocalCache.java:2342)
at com.google.common.cache.LocalCache$Segment.get(LocalCache.java:2257)
at com.google.common.cache.LocalCache.get(LocalCache.java:4000)
at com.google.common.cache.LocalCache.getOrLoad(LocalCache.java:4004)
at com.google.common.cache.LocalCache$LocalLoadingCache.get(LocalCache.java:4874)
at org.jclouds.rest.suppliers.MemoizedRetryOnTimeOutButNotOnAuthorizationExceptionSupplier.get(MemoizedRetryOnTimeOutButNotOnAuthorizationExceptionSupplier.java:123)
at org.jclouds.compute.domain.internal.TemplateBuilderImpl.getImages(TemplateBuilderImpl.java:838)
at org.jclouds.compute.domain.internal.TemplateBuilderImpl.build(TemplateBuilderImpl.java:654)
at org.jclouds.compute.domain.internal.TemplateBuilderImpl.build(TemplateBuilderImpl.java:648)
at org.jclouds.compute.internal.BaseTemplateBuilderLiveTest.testCompareSizes(BaseTemplateBuilderLiveTest.java:69)
at sun.reflect.NativeMethodAccessorImpl.invoke0(Native Method)
at sun.reflect.NativeMethodAccessorImpl.invoke(NativeMethodAccessorImpl.java:39)
at sun.reflect.DelegatingMethodAccessorImpl.invoke(DelegatingMethodAccessorImpl.java:25)
at java.lang.reflect.Method.invoke(Method.java:597)
at org.testng.internal.MethodInvocationHelper.invokeMethod(MethodInvocationHelper.java:80)
at org.testng.internal.Invoker.invokeMethod(Invoker.java:714)
at org.testng.internal.Invoker.invokeTestMethod(Invoker.java:901)
at org.testng.internal.Invoker.invokeTestMethods(Invoker.java:1231)
at org.testng.internal.TestMethodWorker.invokeTestMethods(TestMethodWorker.java:127)
at org.testng.internal.TestMethodWorker.run(TestMethodWorker.java:111)
at org.testng.TestRunner.privateRun(TestRunner.java:767)
at org.testng.TestRunner.run(TestRunner.java:617)
at org.testng.SuiteRunner.runTest(SuiteRunner.java:334)
at org.testng.SuiteRunner.access$000(SuiteRunner.java:37)
at org.testng.SuiteRunner$SuiteWorker.run(SuiteRunner.java:368)
at org.testng.internal.thread.ThreadUtil$2.call(ThreadUtil.java:64)
at java.util.concurrent.FutureTask$Sync.innerRun(FutureTask.java:303)
at java.util.concurrent.FutureTask.run(FutureTask.java:138)
at java.util.concurrent.ThreadPoolExecutor$Worker.runTask(ThreadPoolExecutor.java:895)
at java.util.concurrent.ThreadPoolExecutor$Worker.run(ThreadPoolExecutor.java:918)
at java.lang.Thread.run(Thread.java:680)
testGetCatalog(org.jclouds.greenhousedata.element.vcloud.features.GreenHouseDataElementVCloudCatalogClientLiveTest) Time elapsed: 1.88 sec <<< FAILURE!
java.lang.IllegalStateException: version 1.0 not present in: {1.5=https://mycloud.greenhousedata.com/api/sessions, 5.1=https://mycloud.greenhousedata.com/api/sessions}
at com.google.common.base.Preconditions.checkState(Preconditions.java:149)
at org.jclouds.vcloud.config.VCloudRestClientModule$30.get(VCloudRestClientModule.java:402)
at org.jclouds.vcloud.config.VCloudRestClientModule$30.get(VCloudRestClientModule.java:396)
at org.jclouds.rest.internal.RestAnnotationProcessor.getEndpointFor(RestAnnotationProcessor.java:520)
at org.jclouds.rest.internal.RestAnnotationProcessor.findEndpoint(RestAnnotationProcessor.java:361)
at org.jclouds.rest.internal.RestAnnotationProcessor.apply(RestAnnotationProcessor.java:196)
at org.jclouds.rest.internal.RestAnnotationProcessor.apply(RestAnnotationProcessor.java:134)
at org.jclouds.rest.internal.InvokeSyncToAsyncHttpMethod.toCommand(InvokeSyncToAsyncHttpMethod.java:242)
at org.jclouds.rest.internal.InvokeSyncToAsyncHttpMethod.invoke(InvokeSyncToAsyncHttpMethod.java:127)
at org.jclouds.rest.internal.InvokeSyncToAsyncHttpMethod.apply(InvokeSyncToAsyncHttpMethod.java:99)
at org.jclouds.rest.internal.InvokeSyncToAsyncHttpMethod.apply(InvokeSyncToAsyncHttpMethod.java:60)
at org.jclouds.rest.internal.DelegatesToInvocationFunction.handle(DelegatesToInvocationFunction.java:159)
at org.jclouds.rest.internal.DelegatesToInvocationFunction.invoke(DelegatesToInvocationFunction.java:126)
at com.sun.proxy.$Proxy63.login(Unknown Source)
at org.jclouds.vcloud.config.VCloudRestClientModule$1.get(VCloudRestClientModule.java:160)
at org.jclouds.vcloud.config.VCloudRestClientModule$1.get(VCloudRestClientModule.java:156)
at org.jclouds.rest.suppliers.MemoizedRetryOnTimeOutButNotOnAuthorizationExceptionSupplier$SetAndThrowAuthorizationExceptionSupplierBackedLoader.load(MemoizedRetryOnTimeOutButNotOnAuthorizationExceptionSupplier.java:77)
at org.jclouds.rest.suppliers.MemoizedRetryOnTimeOutButNotOnAuthorizationExceptionSupplier$SetAndThrowAuthorizationExceptionSupplierBackedLoader.load(MemoizedRetryOnTimeOutButNotOnAuthorizationExceptionSupplier.java:61)
at com.google.common.cache.LocalCache$LoadingValueReference.loadFuture(LocalCache.java:3599)
at com.google.common.cache.LocalCache$Segment.loadSync(LocalCache.java:2379)
at com.google.common.cache.LocalCache$Segment.lockedGetOrLoad(LocalCache.java:2342)
at com.google.common.cache.LocalCache$Segment.get(LocalCache.java:2257)
at com.google.common.cache.LocalCache.get(LocalCache.java:4000)
at com.google.common.cache.LocalCache.getOrLoad(LocalCache.java:4004)
at com.google.common.cache.LocalCache$LocalLoadingCache.get(LocalCache.java:4874)
at org.jclouds.rest.suppliers.MemoizedRetryOnTimeOutButNotOnAuthorizationExceptionSupplier.get(MemoizedRetryOnTimeOutButNotOnAuthorizationExceptionSupplier.java:123)
at org.jclouds.vcloud.config.VCloudRestClientModule$OrgNameToOrgSupplier.get(VCloudRestClientModule.java:423)
at org.jclouds.vcloud.config.VCloudRestClientModule$OrgNameToOrgSupplier.get(VCloudRestClientModule.java:412)
at org.jclouds.rest.suppliers.MemoizedRetryOnTimeOutButNotOnAuthorizationExceptionSupplier$SetAndThrowAuthorizationExceptionSupplierBackedLoader.load(MemoizedRetryOnTimeOutButNotOnAuthorizationExceptionSupplier.java:77)
at org.jclouds.rest.suppliers.MemoizedRetryOnTimeOutButNotOnAuthorizationExceptionSupplier$SetAndThrowAuthorizationExceptionSupplierBackedLoader.load(MemoizedRetryOnTimeOutButNotOnAuthorizationExceptionSupplier.java:61)
at com.google.common.cache.LocalCache$LoadingValueReference.loadFuture(LocalCache.java:3599)
at com.google.common.cache.LocalCache$Segment.loadSync(LocalCache.java:2379)
at com.google.common.cache.LocalCache$Segment.lockedGetOrLoad(LocalCache.java:2342)
at com.google.common.cache.LocalCache$Segment.get(LocalCache.java:2257)
at com.google.common.cache.LocalCache.get(LocalCache.java:4000)
at com.google.common.cache.LocalCache.getOrLoad(LocalCache.java:4004)
at com.google.common.cache.LocalCache$LocalLoadingCache.get(LocalCache.java:4874)
at org.jclouds.rest.suppliers.MemoizedRetryOnTimeOutButNotOnAuthorizationExceptionSupplier.get(MemoizedRetryOnTimeOutButNotOnAuthorizationExceptionSupplier.java:123)
at org.jclouds.vcloud.functions.OrgNameToEndpoint.apply(OrgNameToEndpoint.java:52)
at org.jclouds.vcloud.functions.OrgNameToEndpoint.apply(OrgNameToEndpoint.java:38)
at org.jclouds.rest.internal.RestAnnotationProcessor.getEndpointInParametersOrNull(RestAnnotationProcessor.java:486)
at org.jclouds.rest.internal.RestAnnotationProcessor.getEndpointFor(RestAnnotationProcessor.java:509)
at org.jclouds.rest.internal.RestAnnotationProcessor.findEndpoint(RestAnnotationProcessor.java:361)
at org.jclouds.rest.internal.RestAnnotationProcessor.apply(RestAnnotationProcessor.java:194)
at org.jclouds.rest.internal.RestAnnotationProcessor.apply(RestAnnotationProcessor.java:134)
at org.jclouds.rest.internal.InvokeSyncToAsyncHttpMethod.toCommand(InvokeSyncToAsyncHttpMethod.java:242)
at org.jclouds.rest.internal.InvokeSyncToAsyncHttpMethod.invoke(InvokeSyncToAsyncHttpMethod.java:127)
at org.jclouds.rest.internal.InvokeSyncToAsyncHttpMethod.apply(InvokeSyncToAsyncHttpMethod.java:99)
at org.jclouds.rest.internal.InvokeSyncToAsyncHttpMethod.apply(InvokeSyncToAsyncHttpMethod.java:60)
at org.jclouds.reflect.FunctionalReflection$FunctionalInvocationHandler.handleInvocation(FunctionalReflection.java:119)
at com.google.common.reflect.AbstractInvocationHandler.invoke(AbstractInvocationHandler.java:70)
at com.sun.proxy.$Proxy71.findOrgNamed(Unknown Source)
at org.jclouds.vcloud.features.CatalogClientLiveTest.testGetCatalog(CatalogClientLiveTest.java:41)
at sun.reflect.NativeMethodAccessorImpl.invoke0(Native Method)
at sun.reflect.NativeMethodAccessorImpl.invoke(NativeMethodAccessorImpl.java:39)
at sun.reflect.DelegatingMethodAccessorImpl.invoke(DelegatingMethodAccessorImpl.java:25)
at java.lang.reflect.Method.invoke(Method.java:597)
at org.testng.internal.MethodInvocationHelper.invokeMethod(MethodInvocationHelper.java:80)
at org.testng.internal.Invoker.invokeMethod(Invoker.java:714)
at org.testng.internal.Invoker.invokeTestMethod(Invoker.java:901)
at org.testng.internal.Invoker.invokeTestMethods(Invoker.java:1231)
at org.testng.internal.TestMethodWorker.invokeTestMethods(TestMethodWorker.java:127)
at org.testng.internal.TestMethodWorker.run(TestMethodWorker.java:111)
at org.testng.TestRunner.privateRun(TestRunner.java:767)
at org.testng.TestRunner.run(TestRunner.java:617)
at org.testng.SuiteRunner.runTest(SuiteRunner.java:334)
at org.testng.SuiteRunner.access$000(SuiteRunner.java:37)
at org.testng.SuiteRunner$SuiteWorker.run(SuiteRunner.java:368)
at org.testng.internal.thread.ThreadUtil$2.call(ThreadUtil.java:64)
at java.util.concurrent.FutureTask$Sync.innerRun(FutureTask.java:303)
at java.util.concurrent.FutureTask.run(FutureTask.java:138)
at java.util.concurrent.ThreadPoolExecutor$Worker.runTask(ThreadPoolExecutor.java:895)
at java.util.concurrent.ThreadPoolExecutor$Worker.run(ThreadPoolExecutor.java:918)
at java.lang.Thread.run(Thread.java:680)
testCorrectExceptionRunningNodesNotFound(org.jclouds.greenhousedata.element.vcloud.compute.GreenHouseDataElementVCloudComputeServiceLiveTest) Time elapsed: 1.983 sec <<< FAILURE!
org.testng.TestException:
Expected exception java.util.NoSuchElementException but got java.lang.IllegalStateException: version 1.0 not present in: {1.5=https://mycloud.greenhousedata.com/api/sessions, 5.1=https://mycloud.greenhousedata.com/api/sessions}
at org.testng.internal.Invoker.handleInvocationResults(Invoker.java:1497)
at org.testng.internal.Invoker.invokeMethod(Invoker.java:754)
at org.testng.internal.Invoker.invokeTestMethod(Invoker.java:901)
at org.testng.internal.Invoker.invokeTestMethods(Invoker.java:1231)
at org.testng.internal.TestMethodWorker.invokeTestMethods(TestMethodWorker.java:127)
at org.testng.internal.TestMethodWorker.run(TestMethodWorker.java:111)
at org.testng.TestRunner.privateRun(TestRunner.java:767)
at org.testng.TestRunner.run(TestRunner.java:617)
at org.testng.SuiteRunner.runTest(SuiteRunner.java:334)
at org.testng.SuiteRunner.access$000(SuiteRunner.java:37)
at org.testng.SuiteRunner$SuiteWorker.run(SuiteRunner.java:368)
at org.testng.internal.thread.ThreadUtil$2.call(ThreadUtil.java:64)
at java.util.concurrent.FutureTask$Sync.innerRun(FutureTask.java:303)
at java.util.concurrent.FutureTask.run(FutureTask.java:138)
at java.util.concurrent.ThreadPoolExecutor$Worker.runTask(ThreadPoolExecutor.java:895)
at java.util.concurrent.ThreadPoolExecutor$Worker.run(ThreadPoolExecutor.java:918)
at java.lang.Thread.run(Thread.java:680)
Caused by: java.lang.IllegalStateException: version 1.0 not present in: {1.5=https://mycloud.greenhousedata.com/api/sessions, 5.1=https://mycloud.greenhousedata.com/api/sessions}
at com.google.common.base.Preconditions.checkState(Preconditions.java:149)
at org.jclouds.vcloud.config.VCloudRestClientModule$30.get(VCloudRestClientModule.java:402)
at org.jclouds.vcloud.config.VCloudRestClientModule$30.get(VCloudRestClientModule.java:396)
at org.jclouds.rest.internal.RestAnnotationProcessor.getEndpointFor(RestAnnotationProcessor.java:520)
at org.jclouds.rest.internal.RestAnnotationProcessor.findEndpoint(RestAnnotationProcessor.java:361)
at org.jclouds.rest.internal.RestAnnotationProcessor.apply(RestAnnotationProcessor.java:196)
at org.jclouds.rest.internal.RestAnnotationProcessor.apply(RestAnnotationProcessor.java:134)
at org.jclouds.rest.internal.InvokeSyncToAsyncHttpMethod.toCommand(InvokeSyncToAsyncHttpMethod.java:242)
at org.jclouds.rest.internal.InvokeSyncToAsyncHttpMethod.invoke(InvokeSyncToAsyncHttpMethod.java:127)
at org.jclouds.rest.internal.InvokeSyncToAsyncHttpMethod.apply(InvokeSyncToAsyncHttpMethod.java:99)
at org.jclouds.rest.internal.InvokeSyncToAsyncHttpMethod.apply(InvokeSyncToAsyncHttpMethod.java:60)
at org.jclouds.rest.internal.DelegatesToInvocationFunction.handle(DelegatesToInvocationFunction.java:159)
at org.jclouds.rest.internal.DelegatesToInvocationFunction.invoke(DelegatesToInvocationFunction.java:126)
at com.sun.proxy.$Proxy63.login(Unknown Source)
at org.jclouds.vcloud.config.VCloudRestClientModule$1.get(VCloudRestClientModule.java:160)
at org.jclouds.vcloud.config.VCloudRestClientModule$1.get(VCloudRestClientModule.java:156)
at org.jclouds.rest.suppliers.MemoizedRetryOnTimeOutButNotOnAuthorizationExceptionSupplier$SetAndThrowAuthorizationExceptionSupplierBackedLoader.load(MemoizedRetryOnTimeOutButNotOnAuthorizationExceptionSupplier.java:77)
at org.jclouds.rest.suppliers.MemoizedRetryOnTimeOutButNotOnAuthorizationExceptionSupplier$SetAndThrowAuthorizationExceptionSupplierBackedLoader.load(MemoizedRetryOnTimeOutButNotOnAuthorizationExceptionSupplier.java:61)
at com.google.common.cache.LocalCache$LoadingValueReference.loadFuture(LocalCache.java:3599)
at com.google.common.cache.LocalCache$Segment.loadSync(LocalCache.java:2379)
at com.google.common.cache.LocalCache$Segment.lockedGetOrLoad(LocalCache.java:2342)
at com.google.common.cache.LocalCache$Segment.get(LocalCache.java:2257)
at com.google.common.cache.LocalCache.get(LocalCache.java:4000)
at com.google.common.cache.LocalCache.getOrLoad(LocalCache.java:4004)
at com.google.common.cache.LocalCache$LocalLoadingCache.get(LocalCache.java:4874)
at org.jclouds.rest.suppliers.MemoizedRetryOnTimeOutButNotOnAuthorizationExceptionSupplier.get(MemoizedRetryOnTimeOutButNotOnAuthorizationExceptionSupplier.java:123)
at org.jclouds.vcloud.config.VCloudRestClientModule$OrgMapSupplier.get(VCloudRestClientModule.java:284)
at org.jclouds.vcloud.config.VCloudRestClientModule$OrgMapSupplier.get(VCloudRestClientModule.java:270)
at org.jclouds.rest.suppliers.MemoizedRetryOnTimeOutButNotOnAuthorizationExceptionSupplier$SetAndThrowAuthorizationExceptionSupplierBackedLoader.load(MemoizedRetryOnTimeOutButNotOnAuthorizationExceptionSupplier.java:77)
at org.jclouds.rest.suppliers.MemoizedRetryOnTimeOutButNotOnAuthorizationExceptionSupplier$SetAndThrowAuthorizationExceptionSupplierBackedLoader.load(MemoizedRetryOnTimeOutButNotOnAuthorizationExceptionSupplier.java:61)
at com.google.common.cache.LocalCache$LoadingValueReference.loadFuture(LocalCache.java:3599)
at com.google.common.cache.LocalCache$Segment.loadSync(LocalCache.java:2379)
at com.google.common.cache.LocalCache$Segment.lockedGetOrLoad(LocalCache.java:2342)
at com.google.common.cache.LocalCache$Segment.get(LocalCache.java:2257)
at com.google.common.cache.LocalCache.get(LocalCache.java:4000)
at com.google.common.cache.LocalCache.getOrLoad(LocalCache.java:4004)
at com.google.common.cache.LocalCache$LocalLoadingCache.get(LocalCache.java:4874)
at org.jclouds.rest.suppliers.MemoizedRetryOnTimeOutButNotOnAuthorizationExceptionSupplier.get(MemoizedRetryOnTimeOutButNotOnAuthorizationExceptionSupplier.java:123)
at org.jclouds.vcloud.compute.strategy.VCloudComputeServiceAdapter.listNodes(VCloudComputeServiceAdapter.java:138)
at org.jclouds.compute.strategy.impl.AdaptingComputeServiceStrategies.listDetailsOnNodesMatching(AdaptingComputeServiceStrategies.java:126)
at org.jclouds.compute.internal.BaseComputeService.detailsOnAllNodes(BaseComputeService.java:658)
at org.jclouds.compute.internal.BaseComputeService.nodesMatchingFilterAndNotTerminated(BaseComputeService.java:318)
at org.jclouds.compute.internal.BaseComputeService.nodesMatchingFilterAndNotTerminatedExceptionIfNotFound(BaseComputeService.java:327)
at org.jclouds.compute.internal.BaseComputeService.runScriptOnNodesMatching(BaseComputeService.java:553)
at org.jclouds.compute.internal.BaseComputeService.runScriptOnNodesMatching(BaseComputeService.java:526)
at org.jclouds.compute.internal.BaseComputeServiceLiveTest.testCorrectExceptionRunningNodesNotFound(BaseComputeServiceLiveTest.java:203)
at sun.reflect.NativeMethodAccessorImpl.invoke0(Native Method)
at sun.reflect.NativeMethodAccessorImpl.invoke(NativeMethodAccessorImpl.java:39)
at sun.reflect.DelegatingMethodAccessorImpl.invoke(DelegatingMethodAccessorImpl.java:25)
at java.lang.reflect.Method.invoke(Method.java:597)
at org.testng.internal.MethodInvocationHelper.invokeMethod(MethodInvocationHelper.java:80)
at org.testng.internal.Invoker.invokeMethod(Invoker.java:714)
... 15 more
Caused by: java.lang.IllegalStateException: version 1.0 not present in: {1.5=https://mycloud.greenhousedata.com/api/sessions, 5.1=https://mycloud.greenhousedata.com/api/sessions}
at com.google.common.base.Preconditions.checkState(Preconditions.java:149)
at org.jclouds.vcloud.config.VCloudRestClientModule$30.get(VCloudRestClientModule.java:402)
at org.jclouds.vcloud.config.VCloudRestClientModule$30.get(VCloudRestClientModule.java:396)
at org.jclouds.rest.internal.RestAnnotationProcessor.getEndpointFor(RestAnnotationProcessor.java:520)
at org.jclouds.rest.internal.RestAnnotationProcessor.findEndpoint(RestAnnotationProcessor.java:361)
at org.jclouds.rest.internal.RestAnnotationProcessor.apply(RestAnnotationProcessor.java:196)
at org.jclouds.rest.internal.RestAnnotationProcessor.apply(RestAnnotationProcessor.java:134)
at org.jclouds.rest.internal.InvokeSyncToAsyncHttpMethod.toCommand(InvokeSyncToAsyncHttpMethod.java:242)
at org.jclouds.rest.internal.InvokeSyncToAsyncHttpMethod.invoke(InvokeSyncToAsyncHttpMethod.java:127)
at org.jclouds.rest.internal.InvokeSyncToAsyncHttpMethod.apply(InvokeSyncToAsyncHttpMethod.java:99)
at org.jclouds.rest.internal.InvokeSyncToAsyncHttpMethod.apply(InvokeSyncToAsyncHttpMethod.java:60)
at org.jclouds.rest.internal.DelegatesToInvocationFunction.handle(DelegatesToInvocationFunction.java:159)
at org.jclouds.rest.internal.DelegatesToInvocationFunction.invoke(DelegatesToInvocationFunction.java:126)
at com.sun.proxy.$Proxy63.login(Unknown Source)
at org.jclouds.vcloud.config.VCloudRestClientModule$1.get(VCloudRestClientModule.java:160)
at org.jclouds.vcloud.config.VCloudRestClientModule$1.get(VCloudRestClientModule.java:156)
at org.jclouds.rest.suppliers.MemoizedRetryOnTimeOutButNotOnAuthorizationExceptionSupplier$SetAndThrowAuthorizationExceptionSupplierBackedLoader.load(MemoizedRetryOnTimeOutButNotOnAuthorizationExceptionSupplier.java:77)
at org.jclouds.rest.suppliers.MemoizedRetryOnTimeOutButNotOnAuthorizationExceptionSupplier$SetAndThrowAuthorizationExceptionSupplierBackedLoader.load(MemoizedRetryOnTimeOutButNotOnAuthorizationExceptionSupplier.java:61)
at com.google.common.cache.LocalCache$LoadingValueReference.loadFuture(LocalCache.java:3599)
at com.google.common.cache.LocalCache$Segment.loadSync(LocalCache.java:2379)
at com.google.common.cache.LocalCache$Segment.lockedGetOrLoad(LocalCache.java:2342)
at com.google.common.cache.LocalCache$Segment.get(LocalCache.java:2257)
at com.google.common.cache.LocalCache.get(LocalCache.java:4000)
at com.google.common.cache.LocalCache.getOrLoad(LocalCache.java:4004)
at com.google.common.cache.LocalCache$LocalLoadingCache.get(LocalCache.java:4874)
at org.jclouds.rest.suppliers.MemoizedRetryOnTimeOutButNotOnAuthorizationExceptionSupplier.get(MemoizedRetryOnTimeOutButNotOnAuthorizationExceptionSupplier.java:123)
at org.jclouds.vcloud.config.VCloudRestClientModule$OrgMapSupplier.get(VCloudRestClientModule.java:284)
at org.jclouds.vcloud.config.VCloudRestClientModule$OrgMapSupplier.get(VCloudRestClientModule.java:270)
at org.jclouds.rest.suppliers.MemoizedRetryOnTimeOutButNotOnAuthorizationExceptionSupplier$SetAndThrowAuthorizationExceptionSupplierBackedLoader.load(MemoizedRetryOnTimeOutButNotOnAuthorizationExceptionSupplier.java:77)
at org.jclouds.rest.suppliers.MemoizedRetryOnTimeOutButNotOnAuthorizationExceptionSupplier$SetAndThrowAuthorizationExceptionSupplierBackedLoader.load(MemoizedRetryOnTimeOutButNotOnAuthorizationExceptionSupplier.java:61)
at com.google.common.cache.LocalCache$LoadingValueReference.loadFuture(LocalCache.java:3599)
at com.google.common.cache.LocalCache$Segment.loadSync(LocalCache.java:2379)
at com.google.common.cache.LocalCache$Segment.lockedGetOrLoad(LocalCache.java:2342)
at com.google.common.cache.LocalCache$Segment.get(LocalCache.java:2257)
at com.google.common.cache.LocalCache.get(LocalCache.java:4000)
at com.google.common.cache.LocalCache.getOrLoad(LocalCache.java:4004)
at com.google.common.cache.LocalCache$LocalLoadingCache.get(LocalCache.java:4874)
at org.jclouds.rest.suppliers.MemoizedRetryOnTimeOutButNotOnAuthorizationExceptionSupplier.get(MemoizedRetryOnTimeOutButNotOnAuthorizationExceptionSupplier.java:123)
at org.jclouds.vcloud.compute.strategy.VCloudComputeServiceAdapter.listNodes(VCloudComputeServiceAdapter.java:138)
at org.jclouds.compute.strategy.impl.AdaptingComputeServiceStrategies.listDetailsOnNodesMatching(AdaptingComputeServiceStrategies.java:126)
at org.jclouds.compute.internal.BaseComputeService.detailsOnAllNodes(BaseComputeService.java:658)
at org.jclouds.compute.internal.BaseComputeService.nodesMatchingFilterAndNotTerminated(BaseComputeService.java:318)
at org.jclouds.compute.internal.BaseComputeService.nodesMatchingFilterAndNotTerminatedExceptionIfNotFound(BaseComputeService.java:327)
at org.jclouds.compute.internal.BaseComputeService.runScriptOnNodesMatching(BaseComputeService.java:553)
at org.jclouds.compute.internal.BaseComputeService.runScriptOnNodesMatching(BaseComputeService.java:526)
at org.jclouds.compute.internal.BaseComputeServiceLiveTest.testCorrectExceptionRunningNodesNotFound(BaseComputeServiceLiveTest.java:203)
at sun.reflect.NativeMethodAccessorImpl.invoke0(Native Method)
at sun.reflect.NativeMethodAccessorImpl.invoke(NativeMethodAccessorImpl.java:39)
at sun.reflect.DelegatingMethodAccessorImpl.invoke(DelegatingMethodAccessorImpl.java:25)
at java.lang.reflect.Method.invoke(Method.java:597)
at org.testng.internal.MethodInvocationHelper.invokeMethod(MethodInvocationHelper.java:80)
at org.testng.internal.Invoker.invokeMethod(Invoker.java:714)
... 15 more
testFromTemplate(org.jclouds.greenhousedata.element.vcloud.compute.GreenHouseDataElementVCloudTemplateBuilderLiveTest) Time elapsed: 0.18 sec <<< FAILURE!
java.lang.IllegalStateException: version 1.0 not present in: {1.5=https://mycloud.greenhousedata.com/api/sessions, 5.1=https://mycloud.greenhousedata.com/api/sessions}
at com.google.common.base.Preconditions.checkState(Preconditions.java:149)
at org.jclouds.vcloud.config.VCloudRestClientModule$30.get(VCloudRestClientModule.java:402)
at org.jclouds.vcloud.config.VCloudRestClientModule$30.get(VCloudRestClientModule.java:396)
at org.jclouds.rest.internal.RestAnnotationProcessor.getEndpointFor(RestAnnotationProcessor.java:520)
at org.jclouds.rest.internal.RestAnnotationProcessor.findEndpoint(RestAnnotationProcessor.java:361)
at org.jclouds.rest.internal.RestAnnotationProcessor.apply(RestAnnotationProcessor.java:196)
at org.jclouds.rest.internal.RestAnnotationProcessor.apply(RestAnnotationProcessor.java:134)
at org.jclouds.rest.internal.InvokeSyncToAsyncHttpMethod.toCommand(InvokeSyncToAsyncHttpMethod.java:242)
at org.jclouds.rest.internal.InvokeSyncToAsyncHttpMethod.invoke(InvokeSyncToAsyncHttpMethod.java:127)
at org.jclouds.rest.internal.InvokeSyncToAsyncHttpMethod.apply(InvokeSyncToAsyncHttpMethod.java:99)
at org.jclouds.rest.internal.InvokeSyncToAsyncHttpMethod.apply(InvokeSyncToAsyncHttpMethod.java:60)
at org.jclouds.rest.internal.DelegatesToInvocationFunction.handle(DelegatesToInvocationFunction.java:159)
at org.jclouds.rest.internal.DelegatesToInvocationFunction.invoke(DelegatesToInvocationFunction.java:126)
at com.sun.proxy.$Proxy63.login(Unknown Source)
at org.jclouds.vcloud.config.VCloudRestClientModule$1.get(VCloudRestClientModule.java:160)
at org.jclouds.vcloud.config.VCloudRestClientModule$1.get(VCloudRestClientModule.java:156)
at org.jclouds.rest.suppliers.MemoizedRetryOnTimeOutButNotOnAuthorizationExceptionSupplier$SetAndThrowAuthorizationExceptionSupplierBackedLoader.load(MemoizedRetryOnTimeOutButNotOnAuthorizationExceptionSupplier.java:77)
at org.jclouds.rest.suppliers.MemoizedRetryOnTimeOutButNotOnAuthorizationExceptionSupplier$SetAndThrowAuthorizationExceptionSupplierBackedLoader.load(MemoizedRetryOnTimeOutButNotOnAuthorizationExceptionSupplier.java:61)
at com.google.common.cache.LocalCache$LoadingValueReference.loadFuture(LocalCache.java:3599)
at com.google.common.cache.LocalCache$Segment.loadSync(LocalCache.java:2379)
at com.google.common.cache.LocalCache$Segment.lockedGetOrLoad(LocalCache.java:2342)
at com.google.common.cache.LocalCache$Segment.get(LocalCache.java:2257)
at com.google.common.cache.LocalCache.get(LocalCache.java:4000)
at com.google.common.cache.LocalCache.getOrLoad(LocalCache.java:4004)
at com.google.common.cache.LocalCache$LocalLoadingCache.get(LocalCache.java:4874)
at org.jclouds.rest.suppliers.MemoizedRetryOnTimeOutButNotOnAuthorizationExceptionSupplier.get(MemoizedRetryOnTimeOutButNotOnAuthorizationExceptionSupplier.java:123)
at org.jclouds.vcloud.config.VCloudRestClientModule$OrgMapSupplier.get(VCloudRestClientModule.java:284)
at org.jclouds.vcloud.config.VCloudRestClientModule$OrgMapSupplier.get(VCloudRestClientModule.java:270)
at org.jclouds.rest.suppliers.MemoizedRetryOnTimeOutButNotOnAuthorizationExceptionSupplier$SetAndThrowAuthorizationExceptionSupplierBackedLoader.load(MemoizedRetryOnTimeOutButNotOnAuthorizationExceptionSupplier.java:77)
at org.jclouds.rest.suppliers.MemoizedRetryOnTimeOutButNotOnAuthorizationExceptionSupplier$SetAndThrowAuthorizationExceptionSupplierBackedLoader.load(MemoizedRetryOnTimeOutButNotOnAuthorizationExceptionSupplier.java:61)
at com.google.common.cache.LocalCache$LoadingValueReference.loadFuture(LocalCache.java:3599)
at com.google.common.cache.LocalCache$Segment.loadSync(LocalCache.java:2379)
at com.google.common.cache.LocalCache$Segment.lockedGetOrLoad(LocalCache.java:2342)
at com.google.common.cache.LocalCache$Segment.get(LocalCache.java:2257)
at com.google.common.cache.LocalCache.get(LocalCache.java:4000)
at com.google.common.cache.LocalCache.getOrLoad(LocalCache.java:4004)
at com.google.common.cache.LocalCache$LocalLoadingCache.get(LocalCache.java:4874)
at org.jclouds.rest.suppliers.MemoizedRetryOnTimeOutButNotOnAuthorizationExceptionSupplier.get(MemoizedRetryOnTimeOutButNotOnAuthorizationExceptionSupplier.java:123)
at org.jclouds.vcloud.suppliers.VAppTemplatesSupplier.get(VAppTemplatesSupplier.java:71)
at org.jclouds.vcloud.suppliers.VAppTemplatesSupplier.get(VAppTemplatesSupplier.java:49)
at org.jclouds.vcloud.compute.strategy.VCloudComputeServiceAdapter.supportedTemplates(VCloudComputeServiceAdapter.java:105)
at org.jclouds.vcloud.compute.strategy.VCloudComputeServiceAdapter.listImages(VCloudComputeServiceAdapter.java:131)
at org.jclouds.compute.config.ComputeServiceAdapterContextModule$2.get(ComputeServiceAdapterContextModule.java:127)
at org.jclouds.compute.config.ComputeServiceAdapterContextModule$2.get(ComputeServiceAdapterContextModule.java:124)
at org.jclouds.rest.suppliers.MemoizedRetryOnTimeOutButNotOnAuthorizationExceptionSupplier$SetAndThrowAuthorizationExceptionSupplierBackedLoader.load(MemoizedRetryOnTimeOutButNotOnAuthorizationExceptionSupplier.java:77)
at org.jclouds.rest.suppliers.MemoizedRetryOnTimeOutButNotOnAuthorizationExceptionSupplier$SetAndThrowAuthorizationExceptionSupplierBackedLoader.load(MemoizedRetryOnTimeOutButNotOnAuthorizationExceptionSupplier.java:61)
at com.google.common.cache.LocalCache$LoadingValueReference.loadFuture(LocalCache.java:3599)
at com.google.common.cache.LocalCache$Segment.loadSync(LocalCache.java:2379)
at com.google.common.cache.LocalCache$Segment.lockedGetOrLoad(LocalCache.java:2342)
at com.google.common.cache.LocalCache$Segment.get(LocalCache.java:2257)
at com.google.common.cache.LocalCache.get(LocalCache.java:4000)
at com.google.common.cache.LocalCache.getOrLoad(LocalCache.java:4004)
at com.google.common.cache.LocalCache$LocalLoadingCache.get(LocalCache.java:4874)
at org.jclouds.rest.suppliers.MemoizedRetryOnTimeOutButNotOnAuthorizationExceptionSupplier.get(MemoizedRetryOnTimeOutButNotOnAuthorizationExceptionSupplier.java:123)
at org.jclouds.compute.domain.internal.TemplateBuilderImpl.getImages(TemplateBuilderImpl.java:838)
at org.jclouds.compute.domain.internal.TemplateBuilderImpl.build(TemplateBuilderImpl.java:654)
at org.jclouds.compute.domain.internal.TemplateBuilderImpl.build(TemplateBuilderImpl.java:648)
at org.jclouds.compute.internal.BaseTemplateBuilderLiveTest.testFromTemplate(BaseTemplateBuilderLiveTest.java:92)
at sun.reflect.NativeMethodAccessorImpl.invoke0(Native Method)
at sun.reflect.NativeMethodAccessorImpl.invoke(NativeMethodAccessorImpl.java:39)
at sun.reflect.DelegatingMethodAccessorImpl.invoke(DelegatingMethodAccessorImpl.java:25)
at java.lang.reflect.Method.invoke(Method.java:597)
at org.testng.internal.MethodInvocationHelper.invokeMethod(MethodInvocationHelper.java:80)
at org.testng.internal.Invoker.invokeMethod(Invoker.java:714)
at org.testng.internal.Invoker.invokeTestMethod(Invoker.java:901)
at org.testng.internal.Invoker.invokeTestMethods(Invoker.java:1231)
at org.testng.internal.TestMethodWorker.invokeTestMethods(TestMethodWorker.java:127)
at org.testng.internal.TestMethodWorker.run(TestMethodWorker.java:111)
at org.testng.TestRunner.privateRun(TestRunner.java:767)
at org.testng.TestRunner.run(TestRunner.java:617)
at org.testng.SuiteRunner.runTest(SuiteRunner.java:334)
at org.testng.SuiteRunner.access$000(SuiteRunner.java:37)
at org.testng.SuiteRunner$SuiteWorker.run(SuiteRunner.java:368)
at org.testng.internal.thread.ThreadUtil$2.call(ThreadUtil.java:64)
at java.util.concurrent.FutureTask$Sync.innerRun(FutureTask.java:303)
at java.util.concurrent.FutureTask.run(FutureTask.java:138)
at java.util.concurrent.ThreadPoolExecutor$Worker.runTask(ThreadPoolExecutor.java:895)
at java.util.concurrent.ThreadPoolExecutor$Worker.run(ThreadPoolExecutor.java:918)
at java.lang.Thread.run(Thread.java:680)
testCaptureVApp(org.jclouds.greenhousedata.element.vcloud.features.GreenHouseDataElementVCloudVAppTemplateClientLiveTest) Time elapsed: 0.124 sec <<< FAILURE!
java.lang.IllegalStateException: version 1.0 not present in: {1.5=https://mycloud.greenhousedata.com/api/sessions, 5.1=https://mycloud.greenhousedata.com/api/sessions}
at com.google.common.base.Preconditions.checkState(Preconditions.java:149)
at org.jclouds.vcloud.config.VCloudRestClientModule$30.get(VCloudRestClientModule.java:402)
at org.jclouds.vcloud.config.VCloudRestClientModule$30.get(VCloudRestClientModule.java:396)
at org.jclouds.rest.internal.RestAnnotationProcessor.getEndpointFor(RestAnnotationProcessor.java:520)
at org.jclouds.rest.internal.RestAnnotationProcessor.findEndpoint(RestAnnotationProcessor.java:361)
at org.jclouds.rest.internal.RestAnnotationProcessor.apply(RestAnnotationProcessor.java:196)
at org.jclouds.rest.internal.RestAnnotationProcessor.apply(RestAnnotationProcessor.java:134)
at org.jclouds.rest.internal.InvokeSyncToAsyncHttpMethod.toCommand(InvokeSyncToAsyncHttpMethod.java:242)
at org.jclouds.rest.internal.InvokeSyncToAsyncHttpMethod.invoke(InvokeSyncToAsyncHttpMethod.java:127)
at org.jclouds.rest.internal.InvokeSyncToAsyncHttpMethod.apply(InvokeSyncToAsyncHttpMethod.java:99)
at org.jclouds.rest.internal.InvokeSyncToAsyncHttpMethod.apply(InvokeSyncToAsyncHttpMethod.java:60)
at org.jclouds.rest.internal.DelegatesToInvocationFunction.handle(DelegatesToInvocationFunction.java:159)
at org.jclouds.rest.internal.DelegatesToInvocationFunction.invoke(DelegatesToInvocationFunction.java:126)
at com.sun.proxy.$Proxy63.login(Unknown Source)
at org.jclouds.vcloud.config.VCloudRestClientModule$1.get(VCloudRestClientModule.java:160)
at org.jclouds.vcloud.config.VCloudRestClientModule$1.get(VCloudRestClientModule.java:156)
at org.jclouds.rest.suppliers.MemoizedRetryOnTimeOutButNotOnAuthorizationExceptionSupplier$SetAndThrowAuthorizationExceptionSupplierBackedLoader.load(MemoizedRetryOnTimeOutButNotOnAuthorizationExceptionSupplier.java:77)
at org.jclouds.rest.suppliers.MemoizedRetryOnTimeOutButNotOnAuthorizationExceptionSupplier$SetAndThrowAuthorizationExceptionSupplierBackedLoader.load(MemoizedRetryOnTimeOutButNotOnAuthorizationExceptionSupplier.java:61)
at com.google.common.cache.LocalCache$LoadingValueReference.loadFuture(LocalCache.java:3599)
at com.google.common.cache.LocalCache$Segment.loadSync(LocalCache.java:2379)
at com.google.common.cache.LocalCache$Segment.lockedGetOrLoad(LocalCache.java:2342)
at com.google.common.cache.LocalCache$Segment.get(LocalCache.java:2257)
at com.google.common.cache.LocalCache.get(LocalCache.java:4000)
at com.google.common.cache.LocalCache.getOrLoad(LocalCache.java:4004)
at com.google.common.cache.LocalCache$LocalLoadingCache.get(LocalCache.java:4874)
at org.jclouds.rest.suppliers.MemoizedRetryOnTimeOutButNotOnAuthorizationExceptionSupplier.get(MemoizedRetryOnTimeOutButNotOnAuthorizationExceptionSupplier.java:123)
at org.jclouds.vcloud.config.VCloudRestClientModule$OrgMapSupplier.get(VCloudRestClientModule.java:284)
at org.jclouds.vcloud.config.VCloudRestClientModule$OrgMapSupplier.get(VCloudRestClientModule.java:270)
at org.jclouds.rest.suppliers.MemoizedRetryOnTimeOutButNotOnAuthorizationExceptionSupplier$SetAndThrowAuthorizationExceptionSupplierBackedLoader.load(MemoizedRetryOnTimeOutButNotOnAuthorizationExceptionSupplier.java:77)
at org.jclouds.rest.suppliers.MemoizedRetryOnTimeOutButNotOnAuthorizationExceptionSupplier$SetAndThrowAuthorizationExceptionSupplierBackedLoader.load(MemoizedRetryOnTimeOutButNotOnAuthorizationExceptionSupplier.java:61)
at com.google.common.cache.LocalCache$LoadingValueReference.loadFuture(LocalCache.java:3599)
at com.google.common.cache.LocalCache$Segment.loadSync(LocalCache.java:2379)
at com.google.common.cache.LocalCache$Segment.lockedGetOrLoad(LocalCache.java:2342)
at com.google.common.cache.LocalCache$Segment.get(LocalCache.java:2257)
at com.google.common.cache.LocalCache.get(LocalCache.java:4000)
at com.google.common.cache.LocalCache.getOrLoad(LocalCache.java:4004)
at com.google.common.cache.LocalCache$LocalLoadingCache.get(LocalCache.java:4874)
at org.jclouds.rest.suppliers.MemoizedRetryOnTimeOutButNotOnAuthorizationExceptionSupplier.get(MemoizedRetryOnTimeOutButNotOnAuthorizationExceptionSupplier.java:123)
at org.jclouds.vcloud.suppliers.VAppTemplatesSupplier.get(VAppTemplatesSupplier.java:71)
at org.jclouds.vcloud.suppliers.VAppTemplatesSupplier.get(VAppTemplatesSupplier.java:49)
at org.jclouds.vcloud.compute.strategy.VCloudComputeServiceAdapter.supportedTemplates(VCloudComputeServiceAdapter.java:105)
at org.jclouds.vcloud.compute.strategy.VCloudComputeServiceAdapter.listImages(VCloudComputeServiceAdapter.java:131)
at org.jclouds.compute.config.ComputeServiceAdapterContextModule$2.get(ComputeServiceAdapterContextModule.java:127)
at org.jclouds.compute.config.ComputeServiceAdapterContextModule$2.get(ComputeServiceAdapterContextModule.java:124)
at org.jclouds.rest.suppliers.MemoizedRetryOnTimeOutButNotOnAuthorizationExceptionSupplier$SetAndThrowAuthorizationExceptionSupplierBackedLoader.load(MemoizedRetryOnTimeOutButNotOnAuthorizationExceptionSupplier.java:77)
at org.jclouds.rest.suppliers.MemoizedRetryOnTimeOutButNotOnAuthorizationExceptionSupplier$SetAndThrowAuthorizationExceptionSupplierBackedLoader.load(MemoizedRetryOnTimeOutButNotOnAuthorizationExceptionSupplier.java:61)
at com.google.common.cache.LocalCache$LoadingValueReference.loadFuture(LocalCache.java:3599)
at com.google.common.cache.LocalCache$Segment.loadSync(LocalCache.java:2379)
at com.google.common.cache.LocalCache$Segment.lockedGetOrLoad(LocalCache.java:2342)
at com.google.common.cache.LocalCache$Segment.get(LocalCache.java:2257)
at com.google.common.cache.LocalCache.get(LocalCache.java:4000)
at com.google.common.cache.LocalCache.getOrLoad(LocalCache.java:4004)
at com.google.common.cache.LocalCache$LocalLoadingCache.get(LocalCache.java:4874)
at org.jclouds.rest.suppliers.MemoizedRetryOnTimeOutButNotOnAuthorizationExceptionSupplier.get(MemoizedRetryOnTimeOutButNotOnAuthorizationExceptionSupplier.java:123)
at org.jclouds.compute.domain.internal.TemplateBuilderImpl.getImages(TemplateBuilderImpl.java:838)
at org.jclouds.compute.domain.internal.TemplateBuilderImpl.build(TemplateBuilderImpl.java:654)
at org.jclouds.compute.internal.BaseComputeService.createNodesInGroup(BaseComputeService.java:234)
at org.jclouds.compute.internal.BaseComputeService.createNodesInGroup(BaseComputeService.java:239)
at org.jclouds.vcloud.features.VAppTemplateClientLiveTest.testCaptureVApp(VAppTemplateClientLiveTest.java:122)
at sun.reflect.NativeMethodAccessorImpl.invoke0(Native Method)
at sun.reflect.NativeMethodAccessorImpl.invoke(NativeMethodAccessorImpl.java:39)
at sun.reflect.DelegatingMethodAccessorImpl.invoke(DelegatingMethodAccessorImpl.java:25)
at java.lang.reflect.Method.invoke(Method.java:597)
at org.testng.internal.MethodInvocationHelper.invokeMethod(MethodInvocationHelper.java:80)
at org.testng.internal.Invoker.invokeMethod(Invoker.java:714)
at org.testng.internal.Invoker.invokeTestMethod(Invoker.java:901)
at org.testng.internal.Invoker.invokeTestMethods(Invoker.java:1231)
at org.testng.internal.TestMethodWorker.invokeTestMethods(TestMethodWorker.java:127)
at org.testng.internal.TestMethodWorker.run(TestMethodWorker.java:111)
at org.testng.TestRunner.privateRun(TestRunner.java:767)
at org.testng.TestRunner.run(TestRunner.java:617)
at org.testng.SuiteRunner.runTest(SuiteRunner.java:334)
at org.testng.SuiteRunner.access$000(SuiteRunner.java:37)
at org.testng.SuiteRunner$SuiteWorker.run(SuiteRunner.java:368)
at org.testng.internal.thread.ThreadUtil$2.call(ThreadUtil.java:64)
at java.util.concurrent.FutureTask$Sync.innerRun(FutureTask.java:303)
at java.util.concurrent.FutureTask.run(FutureTask.java:138)
at java.util.concurrent.ThreadPoolExecutor$Worker.runTask(ThreadPoolExecutor.java:895)
at java.util.concurrent.ThreadPoolExecutor$Worker.run(ThreadPoolExecutor.java:918)
at java.lang.Thread.run(Thread.java:680)
testExtendedOptionsWithCustomizationScript(org.jclouds.greenhousedata.element.vcloud.features.GreenHouseDataElementVCloudVmClientLiveTest) Time elapsed: 0.114 sec <<< FAILURE!
java.lang.IllegalStateException: version 1.0 not present in: {1.5=https://mycloud.greenhousedata.com/api/sessions, 5.1=https://mycloud.greenhousedata.com/api/sessions}
at com.google.common.base.Preconditions.checkState(Preconditions.java:149)
at org.jclouds.vcloud.config.VCloudRestClientModule$30.get(VCloudRestClientModule.java:402)
at org.jclouds.vcloud.config.VCloudRestClientModule$30.get(VCloudRestClientModule.java:396)
at org.jclouds.rest.internal.RestAnnotationProcessor.getEndpointFor(RestAnnotationProcessor.java:520)
at org.jclouds.rest.internal.RestAnnotationProcessor.findEndpoint(RestAnnotationProcessor.java:361)
at org.jclouds.rest.internal.RestAnnotationProcessor.apply(RestAnnotationProcessor.java:196)
at org.jclouds.rest.internal.RestAnnotationProcessor.apply(RestAnnotationProcessor.java:134)
at org.jclouds.rest.internal.InvokeSyncToAsyncHttpMethod.toCommand(InvokeSyncToAsyncHttpMethod.java:242)
at org.jclouds.rest.internal.InvokeSyncToAsyncHttpMethod.invoke(InvokeSyncToAsyncHttpMethod.java:127)
at org.jclouds.rest.internal.InvokeSyncToAsyncHttpMethod.apply(InvokeSyncToAsyncHttpMethod.java:99)
at org.jclouds.rest.internal.InvokeSyncToAsyncHttpMethod.apply(InvokeSyncToAsyncHttpMethod.java:60)
at org.jclouds.rest.internal.DelegatesToInvocationFunction.handle(DelegatesToInvocationFunction.java:159)
at org.jclouds.rest.internal.DelegatesToInvocationFunction.invoke(DelegatesToInvocationFunction.java:126)
at com.sun.proxy.$Proxy63.login(Unknown Source)
at org.jclouds.vcloud.config.VCloudRestClientModule$1.get(VCloudRestClientModule.java:160)
at org.jclouds.vcloud.config.VCloudRestClientModule$1.get(VCloudRestClientModule.java:156)
at org.jclouds.rest.suppliers.MemoizedRetryOnTimeOutButNotOnAuthorizationExceptionSupplier$SetAndThrowAuthorizationExceptionSupplierBackedLoader.load(MemoizedRetryOnTimeOutButNotOnAuthorizationExceptionSupplier.java:77)
at org.jclouds.rest.suppliers.MemoizedRetryOnTimeOutButNotOnAuthorizationExceptionSupplier$SetAndThrowAuthorizationExceptionSupplierBackedLoader.load(MemoizedRetryOnTimeOutButNotOnAuthorizationExceptionSupplier.java:61)
at com.google.common.cache.LocalCache$LoadingValueReference.loadFuture(LocalCache.java:3599)
at com.google.common.cache.LocalCache$Segment.loadSync(LocalCache.java:2379)
at com.google.common.cache.LocalCache$Segment.lockedGetOrLoad(LocalCache.java:2342)
at com.google.common.cache.LocalCache$Segment.get(LocalCache.java:2257)
at com.google.common.cache.LocalCache.get(LocalCache.java:4000)
at com.google.common.cache.LocalCache.getOrLoad(LocalCache.java:4004)
at com.google.common.cache.LocalCache$LocalLoadingCache.get(LocalCache.java:4874)
at org.jclouds.rest.suppliers.MemoizedRetryOnTimeOutButNotOnAuthorizationExceptionSupplier.get(MemoizedRetryOnTimeOutButNotOnAuthorizationExceptionSupplier.java:123)
at org.jclouds.vcloud.config.VCloudRestClientModule$OrgMapSupplier.get(VCloudRestClientModule.java:284)
at org.jclouds.vcloud.config.VCloudRestClientModule$OrgMapSupplier.get(VCloudRestClientModule.java:270)
at org.jclouds.rest.suppliers.MemoizedRetryOnTimeOutButNotOnAuthorizationExceptionSupplier$SetAndThrowAuthorizationExceptionSupplierBackedLoader.load(MemoizedRetryOnTimeOutButNotOnAuthorizationExceptionSupplier.java:77)
at org.jclouds.rest.suppliers.MemoizedRetryOnTimeOutButNotOnAuthorizationExceptionSupplier$SetAndThrowAuthorizationExceptionSupplierBackedLoader.load(MemoizedRetryOnTimeOutButNotOnAuthorizationExceptionSupplier.java:61)
at com.google.common.cache.LocalCache$LoadingValueReference.loadFuture(LocalCache.java:3599)
at com.google.common.cache.LocalCache$Segment.loadSync(LocalCache.java:2379)
at com.google.common.cache.LocalCache$Segment.lockedGetOrLoad(LocalCache.java:2342)
at com.google.common.cache.LocalCache$Segment.get(LocalCache.java:2257)
at com.google.common.cache.LocalCache.get(LocalCache.java:4000)
at com.google.common.cache.LocalCache.getOrLoad(LocalCache.java:4004)
at com.google.common.cache.LocalCache$LocalLoadingCache.get(LocalCache.java:4874)
at org.jclouds.rest.suppliers.MemoizedRetryOnTimeOutButNotOnAuthorizationExceptionSupplier.get(MemoizedRetryOnTimeOutButNotOnAuthorizationExceptionSupplier.java:123)
at org.jclouds.vcloud.suppliers.VAppTemplatesSupplier.get(VAppTemplatesSupplier.java:71)
at org.jclouds.vcloud.suppliers.VAppTemplatesSupplier.get(VAppTemplatesSupplier.java:49)
at org.jclouds.vcloud.compute.strategy.VCloudComputeServiceAdapter.supportedTemplates(VCloudComputeServiceAdapter.java:105)
at org.jclouds.vcloud.compute.strategy.VCloudComputeServiceAdapter.listImages(VCloudComputeServiceAdapter.java:131)
at org.jclouds.compute.config.ComputeServiceAdapterContextModule$2.get(ComputeServiceAdapterContextModule.java:127)
at org.jclouds.compute.config.ComputeServiceAdapterContextModule$2.get(ComputeServiceAdapterContextModule.java:124)
at org.jclouds.rest.suppliers.MemoizedRetryOnTimeOutButNotOnAuthorizationExceptionSupplier$SetAndThrowAuthorizationExceptionSupplierBackedLoader.load(MemoizedRetryOnTimeOutButNotOnAuthorizationExceptionSupplier.java:77)
at org.jclouds.rest.suppliers.MemoizedRetryOnTimeOutButNotOnAuthorizationExceptionSupplier$SetAndThrowAuthorizationExceptionSupplierBackedLoader.load(MemoizedRetryOnTimeOutButNotOnAuthorizationExceptionSupplier.java:61)
at com.google.common.cache.LocalCache$LoadingValueReference.loadFuture(LocalCache.java:3599)
at com.google.common.cache.LocalCache$Segment.loadSync(LocalCache.java:2379)
at com.google.common.cache.LocalCache$Segment.lockedGetOrLoad(LocalCache.java:2342)
at com.google.common.cache.LocalCache$Segment.get(LocalCache.java:2257)
at com.google.common.cache.LocalCache.get(LocalCache.java:4000)
at com.google.common.cache.LocalCache.getOrLoad(LocalCache.java:4004)
at com.google.common.cache.LocalCache$LocalLoadingCache.get(LocalCache.java:4874)
at org.jclouds.rest.suppliers.MemoizedRetryOnTimeOutButNotOnAuthorizationExceptionSupplier.get(MemoizedRetryOnTimeOutButNotOnAuthorizationExceptionSupplier.java:123)
at org.jclouds.compute.domain.internal.TemplateBuilderImpl.getImages(TemplateBuilderImpl.java:838)
at org.jclouds.compute.domain.internal.TemplateBuilderImpl.build(TemplateBuilderImpl.java:654)
at org.jclouds.compute.internal.BaseComputeService.createNodesInGroup(BaseComputeService.java:234)
at org.jclouds.vcloud.features.VmClientLiveTest.testExtendedOptionsWithCustomizationScript(VmClientLiveTest.java:111)
at sun.reflect.NativeMethodAccessorImpl.invoke0(Native Method)
at sun.reflect.NativeMethodAccessorImpl.invoke(NativeMethodAccessorImpl.java:39)
at sun.reflect.DelegatingMethodAccessorImpl.invoke(DelegatingMethodAccessorImpl.java:25)
at java.lang.reflect.Method.invoke(Method.java:597)
at org.testng.internal.MethodInvocationHelper.invokeMethod(MethodInvocationHelper.java:80)
at org.testng.internal.Invoker.invokeMethod(Invoker.java:714)
at org.testng.internal.Invoker.invokeTestMethod(Invoker.java:901)
at org.testng.internal.Invoker.invokeTestMethods(Invoker.java:1231)
at org.testng.internal.TestMethodWorker.invokeTestMethods(TestMethodWorker.java:127)
at org.testng.internal.TestMethodWorker.run(TestMethodWorker.java:111)
at org.testng.TestRunner.privateRun(TestRunner.java:767)
at org.testng.TestRunner.run(TestRunner.java:617)
at org.testng.SuiteRunner.runTest(SuiteRunner.java:334)
at org.testng.SuiteRunner.access$000(SuiteRunner.java:37)
at org.testng.SuiteRunner$SuiteWorker.run(SuiteRunner.java:368)
at org.testng.internal.thread.ThreadUtil$2.call(ThreadUtil.java:64)
at java.util.concurrent.FutureTask$Sync.innerRun(FutureTask.java:303)
at java.util.concurrent.FutureTask.run(FutureTask.java:138)
at java.util.concurrent.ThreadPoolExecutor$Worker.runTask(ThreadPoolExecutor.java:895)
at java.util.concurrent.ThreadPoolExecutor$Worker.run(ThreadPoolExecutor.java:918)
at java.lang.Thread.run(Thread.java:680)
testGetAssignableLocations(org.jclouds.greenhousedata.element.vcloud.compute.GreenHouseDataElementVCloudComputeServiceLiveTest) Time elapsed: 1.78 sec <<< FAILURE!
java.lang.IllegalStateException: version 1.0 not present in: {1.5=https://mycloud.greenhousedata.com/api/sessions, 5.1=https://mycloud.greenhousedata.com/api/sessions}
at com.google.common.base.Preconditions.checkState(Preconditions.java:149)
at org.jclouds.vcloud.config.VCloudRestClientModule$30.get(VCloudRestClientModule.java:402)
at org.jclouds.vcloud.config.VCloudRestClientModule$30.get(VCloudRestClientModule.java:396)
at org.jclouds.rest.internal.RestAnnotationProcessor.getEndpointFor(RestAnnotationProcessor.java:520)
at org.jclouds.rest.internal.RestAnnotationProcessor.findEndpoint(RestAnnotationProcessor.java:361)
at org.jclouds.rest.internal.RestAnnotationProcessor.apply(RestAnnotationProcessor.java:196)
at org.jclouds.rest.internal.RestAnnotationProcessor.apply(RestAnnotationProcessor.java:134)
at org.jclouds.rest.internal.InvokeSyncToAsyncHttpMethod.toCommand(InvokeSyncToAsyncHttpMethod.java:242)
at org.jclouds.rest.internal.InvokeSyncToAsyncHttpMethod.invoke(InvokeSyncToAsyncHttpMethod.java:127)
at org.jclouds.rest.internal.InvokeSyncToAsyncHttpMethod.apply(InvokeSyncToAsyncHttpMethod.java:99)
at org.jclouds.rest.internal.InvokeSyncToAsyncHttpMethod.apply(InvokeSyncToAsyncHttpMethod.java:60)
at org.jclouds.rest.internal.DelegatesToInvocationFunction.handle(DelegatesToInvocationFunction.java:159)
at org.jclouds.rest.internal.DelegatesToInvocationFunction.invoke(DelegatesToInvocationFunction.java:126)
at com.sun.proxy.$Proxy63.login(Unknown Source)
at org.jclouds.vcloud.config.VCloudRestClientModule$1.get(VCloudRestClientModule.java:160)
at org.jclouds.vcloud.config.VCloudRestClientModule$1.get(VCloudRestClientModule.java:156)
at org.jclouds.rest.suppliers.MemoizedRetryOnTimeOutButNotOnAuthorizationExceptionSupplier$SetAndThrowAuthorizationExceptionSupplierBackedLoader.load(MemoizedRetryOnTimeOutButNotOnAuthorizationExceptionSupplier.java:77)
at org.jclouds.rest.suppliers.MemoizedRetryOnTimeOutButNotOnAuthorizationExceptionSupplier$SetAndThrowAuthorizationExceptionSupplierBackedLoader.load(MemoizedRetryOnTimeOutButNotOnAuthorizationExceptionSupplier.java:61)
at com.google.common.cache.LocalCache$LoadingValueReference.loadFuture(LocalCache.java:3599)
at com.google.common.cache.LocalCache$Segment.loadSync(LocalCache.java:2379)
at com.google.common.cache.LocalCache$Segment.lockedGetOrLoad(LocalCache.java:2342)
at com.google.common.cache.LocalCache$Segment.get(LocalCache.java:2257)
at com.google.common.cache.LocalCache.get(LocalCache.java:4000)
at com.google.common.cache.LocalCache.getOrLoad(LocalCache.java:4004)
at com.google.common.cache.LocalCache$LocalLoadingCache.get(LocalCache.java:4874)
at org.jclouds.rest.suppliers.MemoizedRetryOnTimeOutButNotOnAuthorizationExceptionSupplier.get(MemoizedRetryOnTimeOutButNotOnAuthorizationExceptionSupplier.java:123)
at org.jclouds.vcloud.config.VCloudRestClientModule$OrgNameToOrgSupplier.get(VCloudRestClientModule.java:423)
at org.jclouds.vcloud.config.VCloudRestClientModule$OrgNameToOrgSupplier.get(VCloudRestClientModule.java:412)
at org.jclouds.rest.suppliers.MemoizedRetryOnTimeOutButNotOnAuthorizationExceptionSupplier$SetAndThrowAuthorizationExceptionSupplierBackedLoader.load(MemoizedRetryOnTimeOutButNotOnAuthorizationExceptionSupplier.java:77)
at org.jclouds.rest.suppliers.MemoizedRetryOnTimeOutButNotOnAuthorizationExceptionSupplier$SetAndThrowAuthorizationExceptionSupplierBackedLoader.load(MemoizedRetryOnTimeOutButNotOnAuthorizationExceptionSupplier.java:61)
at com.google.common.cache.LocalCache$LoadingValueReference.loadFuture(LocalCache.java:3599)
at com.google.common.cache.LocalCache$Segment.loadSync(LocalCache.java:2379)
at com.google.common.cache.LocalCache$Segment.lockedGetOrLoad(LocalCache.java:2342)
at com.google.common.cache.LocalCache$Segment.get(LocalCache.java:2257)
at com.google.common.cache.LocalCache.get(LocalCache.java:4000)
at com.google.common.cache.LocalCache.getOrLoad(LocalCache.java:4004)
at com.google.common.cache.LocalCache$LocalLoadingCache.get(LocalCache.java:4874)
at org.jclouds.rest.suppliers.MemoizedRetryOnTimeOutButNotOnAuthorizationExceptionSupplier.get(MemoizedRetryOnTimeOutButNotOnAuthorizationExceptionSupplier.java:123)
at org.jclouds.vcloud.location.OrgAndVDCToLocationSupplier.buildJustProviderOrVDCs(OrgAndVDCToLocationSupplier.java:75)
at org.jclouds.vcloud.location.OrgAndVDCToLocationSupplier.get(OrgAndVDCToLocationSupplier.java:69)
at org.jclouds.vcloud.location.OrgAndVDCToLocationSupplier.get(OrgAndVDCToLocationSupplier.java:48)
at org.jclouds.rest.suppliers.MemoizedRetryOnTimeOutButNotOnAuthorizationExceptionSupplier$SetAndThrowAuthorizationExceptionSupplierBackedLoader.load(MemoizedRetryOnTimeOutButNotOnAuthorizationExceptionSupplier.java:77)
at org.jclouds.rest.suppliers.MemoizedRetryOnTimeOutButNotOnAuthorizationExceptionSupplier$SetAndThrowAuthorizationExceptionSupplierBackedLoader.load(MemoizedRetryOnTimeOutButNotOnAuthorizationExceptionSupplier.java:61)
at com.google.common.cache.LocalCache$LoadingValueReference.loadFuture(LocalCache.java:3599)
at com.google.common.cache.LocalCache$Segment.loadSync(LocalCache.java:2379)
at com.google.common.cache.LocalCache$Segment.lockedGetOrLoad(LocalCache.java:2342)
at com.google.common.cache.LocalCache$Segment.get(LocalCache.java:2257)
at com.google.common.cache.LocalCache.get(LocalCache.java:4000)
at com.google.common.cache.LocalCache.getOrLoad(LocalCache.java:4004)
at com.google.common.cache.LocalCache$LocalLoadingCache.get(LocalCache.java:4874)
at org.jclouds.rest.suppliers.MemoizedRetryOnTimeOutButNotOnAuthorizationExceptionSupplier.get(MemoizedRetryOnTimeOutButNotOnAuthorizationExceptionSupplier.java:123)
at org.jclouds.compute.internal.BaseComputeService.listAssignableLocations(BaseComputeService.java:389)
at org.jclouds.compute.internal.BaseComputeServiceLiveTest.testGetAssignableLocations(BaseComputeServiceLiveTest.java:732)
at sun.reflect.NativeMethodAccessorImpl.invoke0(Native Method)
at sun.reflect.NativeMethodAccessorImpl.invoke(NativeMethodAccessorImpl.java:39)
at sun.reflect.DelegatingMethodAccessorImpl.invoke(DelegatingMethodAccessorImpl.java:25)
at java.lang.reflect.Method.invoke(Method.java:597)
at org.testng.internal.MethodInvocationHelper.invokeMethod(MethodInvocationHelper.java:80)
at org.testng.internal.Invoker.invokeMethod(Invoker.java:714)
at org.testng.internal.Invoker.invokeTestMethod(Invoker.java:901)
at org.testng.internal.Invoker.invokeTestMethods(Invoker.java:1231)
at org.testng.internal.TestMethodWorker.invokeTestMethods(TestMethodWorker.java:127)
at org.testng.internal.TestMethodWorker.run(TestMethodWorker.java:111)
at org.testng.TestRunner.privateRun(TestRunner.java:767)
at org.testng.TestRunner.run(TestRunner.java:617)
at org.testng.SuiteRunner.runTest(SuiteRunner.java:334)
at org.testng.SuiteRunner.access$000(SuiteRunner.java:37)
at org.testng.SuiteRunner$SuiteWorker.run(SuiteRunner.java:368)
at org.testng.internal.thread.ThreadUtil$2.call(ThreadUtil.java:64)
at java.util.concurrent.FutureTask$Sync.innerRun(FutureTask.java:303)
at java.util.concurrent.FutureTask.run(FutureTask.java:138)
at java.util.concurrent.ThreadPoolExecutor$Worker.runTask(ThreadPoolExecutor.java:895)
at java.util.concurrent.ThreadPoolExecutor$Worker.run(ThreadPoolExecutor.java:918)
at java.lang.Thread.run(Thread.java:680)
testGetAssignableLocations(org.jclouds.greenhousedata.element.vcloud.compute.GreenHouseDataElementVCloudTemplateBuilderLiveTest) Time elapsed: 0.088 sec <<< FAILURE!
java.lang.IllegalStateException: version 1.0 not present in: {1.5=https://mycloud.greenhousedata.com/api/sessions, 5.1=https://mycloud.greenhousedata.com/api/sessions}
at com.google.common.base.Preconditions.checkState(Preconditions.java:149)
at org.jclouds.vcloud.config.VCloudRestClientModule$30.get(VCloudRestClientModule.java:402)
at org.jclouds.vcloud.config.VCloudRestClientModule$30.get(VCloudRestClientModule.java:396)
at org.jclouds.rest.internal.RestAnnotationProcessor.getEndpointFor(RestAnnotationProcessor.java:520)
at org.jclouds.rest.internal.RestAnnotationProcessor.findEndpoint(RestAnnotationProcessor.java:361)
at org.jclouds.rest.internal.RestAnnotationProcessor.apply(RestAnnotationProcessor.java:196)
at org.jclouds.rest.internal.RestAnnotationProcessor.apply(RestAnnotationProcessor.java:134)
at org.jclouds.rest.internal.InvokeSyncToAsyncHttpMethod.toCommand(InvokeSyncToAsyncHttpMethod.java:242)
at org.jclouds.rest.internal.InvokeSyncToAsyncHttpMethod.invoke(InvokeSyncToAsyncHttpMethod.java:127)
at org.jclouds.rest.internal.InvokeSyncToAsyncHttpMethod.apply(InvokeSyncToAsyncHttpMethod.java:99)
at org.jclouds.rest.internal.InvokeSyncToAsyncHttpMethod.apply(InvokeSyncToAsyncHttpMethod.java:60)
at org.jclouds.rest.internal.DelegatesToInvocationFunction.handle(DelegatesToInvocationFunction.java:159)
at org.jclouds.rest.internal.DelegatesToInvocationFunction.invoke(DelegatesToInvocationFunction.java:126)
at com.sun.proxy.$Proxy63.login(Unknown Source)
at org.jclouds.vcloud.config.VCloudRestClientModule$1.get(VCloudRestClientModule.java:160)
at org.jclouds.vcloud.config.VCloudRestClientModule$1.get(VCloudRestClientModule.java:156)
at org.jclouds.rest.suppliers.MemoizedRetryOnTimeOutButNotOnAuthorizationExceptionSupplier$SetAndThrowAuthorizationExceptionSupplierBackedLoader.load(MemoizedRetryOnTimeOutButNotOnAuthorizationExceptionSupplier.java:77)
at org.jclouds.rest.suppliers.MemoizedRetryOnTimeOutButNotOnAuthorizationExceptionSupplier$SetAndThrowAuthorizationExceptionSupplierBackedLoader.load(MemoizedRetryOnTimeOutButNotOnAuthorizationExceptionSupplier.java:61)
at com.google.common.cache.LocalCache$LoadingValueReference.loadFuture(LocalCache.java:3599)
at com.google.common.cache.LocalCache$Segment.loadSync(LocalCache.java:2379)
at com.google.common.cache.LocalCache$Segment.lockedGetOrLoad(LocalCache.java:2342)
at com.google.common<