blob: e1bb302493748c777cd6b1fe35dbdb6464a4b197 [file] [log] [blame]
-------------------------------------------------------------------------------
Test set: TestSuite
-------------------------------------------------------------------------------
Tests run: 130, Failures: 97, Errors: 0, Skipped: 28, Time elapsed: 110.273 sec <<< FAILURE!
testCompareSizes(org.jclouds.go2cloud.compute.Go2CloudJohannesburg1TemplateBuilderLiveTest) Time elapsed: 4.214 sec <<< FAILURE!
java.lang.ClassCastException: org.jclouds.elasticstack.domain.DriveInfo cannot be cast to java.lang.Comparable
at com.google.common.collect.NaturalOrdering.compare(NaturalOrdering.java:28)
at java.util.Arrays.mergeSort(Arrays.java:1270)
at java.util.Arrays.sort(Arrays.java:1210)
at com.google.common.collect.SortedIterables.sortedUnique(SortedIterables.java:95)
at com.google.common.collect.ImmutableSortedSet.copyOfInternal(ImmutableSortedSet.java:408)
at com.google.common.collect.ImmutableSortedSet.copyOf(ImmutableSortedSet.java:343)
at com.google.common.collect.ImmutableSortedSet.copyOf(ImmutableSortedSet.java:251)
at org.jclouds.util.Iterables2.concreteCopy(Iterables2.java:37)
at org.jclouds.elasticstack.compute.ElasticStackComputeServiceAdapter.listImages(ElasticStackComputeServiceAdapter.java:187)
at org.jclouds.compute.config.ComputeServiceAdapterContextModule$2.get(ComputeServiceAdapterContextModule.java:116)
at org.jclouds.compute.config.ComputeServiceAdapterContextModule$2.get(ComputeServiceAdapterContextModule.java:112)
at org.jclouds.collect.TransformingSetSupplier.get(TransformingSetSupplier.java:47)
at org.jclouds.collect.TransformingSetSupplier.get(TransformingSetSupplier.java:36)
at org.jclouds.compute.config.BaseComputeServiceContextModule$9.get(BaseComputeServiceContextModule.java:247)
at org.jclouds.compute.config.BaseComputeServiceContextModule$9.get(BaseComputeServiceContextModule.java:244)
at org.jclouds.rest.suppliers.SetAndThrowAuthorizationExceptionSupplier.get(SetAndThrowAuthorizationExceptionSupplier.java:49)
at org.jclouds.concurrent.RetryOnTimeOutExceptionSupplier.get(RetryOnTimeOutExceptionSupplier.java:47)
at org.jclouds.util.Suppliers2$ExpiringMemoizingSupplier.get(Suppliers2.java:130)
at org.jclouds.rest.suppliers.MemoizedRetryOnTimeOutButNotOnAuthorizationExceptionSupplier.get(MemoizedRetryOnTimeOutButNotOnAuthorizationExceptionSupplier.java:64)
at org.jclouds.compute.domain.internal.TemplateBuilderImpl.getImages(TemplateBuilderImpl.java:737)
at org.jclouds.compute.domain.internal.TemplateBuilderImpl.build(TemplateBuilderImpl.java:612)
at org.jclouds.compute.domain.internal.TemplateBuilderImpl.build(TemplateBuilderImpl.java:606)
at org.jclouds.compute.internal.BaseTemplateBuilderLiveTest.testCompareSizes(BaseTemplateBuilderLiveTest.java:69)
at sun.reflect.NativeMethodAccessorImpl.invoke0(Native Method)
at sun.reflect.NativeMethodAccessorImpl.invoke(NativeMethodAccessorImpl.java:39)
at sun.reflect.DelegatingMethodAccessorImpl.invoke(DelegatingMethodAccessorImpl.java:25)
at java.lang.reflect.Method.invoke(Method.java:597)
at org.testng.internal.MethodInvocationHelper.invokeMethod(MethodInvocationHelper.java:80)
at org.testng.internal.Invoker.invokeMethod(Invoker.java:701)
at org.testng.internal.Invoker.invokeTestMethod(Invoker.java:893)
at org.testng.internal.Invoker.invokeTestMethods(Invoker.java:1218)
at org.testng.internal.TestMethodWorker.invokeTestMethods(TestMethodWorker.java:127)
at org.testng.internal.TestMethodWorker.run(TestMethodWorker.java:111)
at org.testng.TestRunner.privateRun(TestRunner.java:758)
at org.testng.TestRunner.run(TestRunner.java:613)
at org.testng.SuiteRunner.runTest(SuiteRunner.java:334)
at org.testng.SuiteRunner.access$000(SuiteRunner.java:37)
at org.testng.SuiteRunner$SuiteWorker.run(SuiteRunner.java:368)
at org.testng.internal.thread.ThreadUtil$2.call(ThreadUtil.java:64)
at java.util.concurrent.FutureTask$Sync.innerRun(FutureTask.java:303)
at java.util.concurrent.FutureTask.run(FutureTask.java:138)
at java.util.concurrent.ThreadPoolExecutor$Worker.runTask(ThreadPoolExecutor.java:886)
at java.util.concurrent.ThreadPoolExecutor$Worker.run(ThreadPoolExecutor.java:908)
at java.lang.Thread.run(Thread.java:680)
setupContext(org.jclouds.go2cloud.Go2CloudJohannesburg1ClientLiveTest) Time elapsed: 0.834 sec <<< FAILURE!
java.lang.ClassCastException: org.jclouds.elasticstack.domain.DriveInfo cannot be cast to java.lang.Comparable
at com.google.common.collect.NaturalOrdering.compare(NaturalOrdering.java:28)
at java.util.Arrays.mergeSort(Arrays.java:1270)
at java.util.Arrays.sort(Arrays.java:1210)
at com.google.common.collect.SortedIterables.sortedUnique(SortedIterables.java:95)
at com.google.common.collect.ImmutableSortedSet.copyOfInternal(ImmutableSortedSet.java:408)
at com.google.common.collect.ImmutableSortedSet.copyOf(ImmutableSortedSet.java:343)
at com.google.common.collect.ImmutableSortedSet.copyOf(ImmutableSortedSet.java:251)
at org.jclouds.util.Iterables2.concreteCopy(Iterables2.java:37)
at org.jclouds.elasticstack.compute.ElasticStackComputeServiceAdapter.listImages(ElasticStackComputeServiceAdapter.java:187)
at org.jclouds.compute.config.ComputeServiceAdapterContextModule$2.get(ComputeServiceAdapterContextModule.java:116)
at org.jclouds.compute.config.ComputeServiceAdapterContextModule$2.get(ComputeServiceAdapterContextModule.java:112)
at org.jclouds.collect.TransformingSetSupplier.get(TransformingSetSupplier.java:47)
at org.jclouds.collect.TransformingSetSupplier.get(TransformingSetSupplier.java:36)
at org.jclouds.compute.config.BaseComputeServiceContextModule$9.get(BaseComputeServiceContextModule.java:247)
at org.jclouds.compute.config.BaseComputeServiceContextModule$9.get(BaseComputeServiceContextModule.java:244)
at org.jclouds.rest.suppliers.SetAndThrowAuthorizationExceptionSupplier.get(SetAndThrowAuthorizationExceptionSupplier.java:49)
at org.jclouds.concurrent.RetryOnTimeOutExceptionSupplier.get(RetryOnTimeOutExceptionSupplier.java:47)
at org.jclouds.util.Suppliers2$ExpiringMemoizingSupplier.get(Suppliers2.java:130)
at org.jclouds.rest.suppliers.MemoizedRetryOnTimeOutButNotOnAuthorizationExceptionSupplier.get(MemoizedRetryOnTimeOutButNotOnAuthorizationExceptionSupplier.java:64)
at org.jclouds.compute.domain.internal.TemplateBuilderImpl.getImages(TemplateBuilderImpl.java:737)
at org.jclouds.compute.domain.internal.TemplateBuilderImpl.build(TemplateBuilderImpl.java:612)
at org.jclouds.compute.domain.internal.TemplateBuilderImpl.build(TemplateBuilderImpl.java:606)
at org.jclouds.elasticstack.ElasticStackClientLiveTest.setupContext(ElasticStackClientLiveTest.java:100)
at sun.reflect.NativeMethodAccessorImpl.invoke0(Native Method)
at sun.reflect.NativeMethodAccessorImpl.invoke(NativeMethodAccessorImpl.java:39)
at sun.reflect.DelegatingMethodAccessorImpl.invoke(DelegatingMethodAccessorImpl.java:25)
at java.lang.reflect.Method.invoke(Method.java:597)
at org.testng.internal.MethodInvocationHelper.invokeMethod(MethodInvocationHelper.java:80)
at org.testng.internal.Invoker.invokeConfigurationMethod(Invoker.java:551)
at org.testng.internal.Invoker.invokeConfigurations(Invoker.java:213)
at org.testng.internal.Invoker.invokeConfigurations(Invoker.java:138)
at org.testng.internal.Invoker.invokeBeforeGroupsConfigurations(Invoker.java:930)
at org.testng.internal.Invoker.invokeMethod(Invoker.java:631)
at org.testng.internal.Invoker.invokeTestMethod(Invoker.java:893)
at org.testng.internal.Invoker.invokeTestMethods(Invoker.java:1218)
at org.testng.internal.TestMethodWorker.invokeTestMethods(TestMethodWorker.java:127)
at org.testng.internal.TestMethodWorker.run(TestMethodWorker.java:111)
at org.testng.TestRunner.privateRun(TestRunner.java:758)
at org.testng.TestRunner.run(TestRunner.java:613)
at org.testng.SuiteRunner.runTest(SuiteRunner.java:334)
at org.testng.SuiteRunner.access$000(SuiteRunner.java:37)
at org.testng.SuiteRunner$SuiteWorker.run(SuiteRunner.java:368)
at org.testng.internal.thread.ThreadUtil$2.call(ThreadUtil.java:64)
at java.util.concurrent.FutureTask$Sync.innerRun(FutureTask.java:303)
at java.util.concurrent.FutureTask.run(FutureTask.java:138)
at java.util.concurrent.ThreadPoolExecutor$Worker.runTask(ThreadPoolExecutor.java:886)
at java.util.concurrent.ThreadPoolExecutor$Worker.run(ThreadPoolExecutor.java:908)
at java.lang.Thread.run(Thread.java:680)
testFromTemplate(org.jclouds.go2cloud.compute.Go2CloudJohannesburg1TemplateBuilderLiveTest) Time elapsed: 0.008 sec <<< FAILURE!
java.lang.ClassCastException: org.jclouds.elasticstack.domain.DriveInfo cannot be cast to java.lang.Comparable
at com.google.common.collect.NaturalOrdering.compare(NaturalOrdering.java:28)
at java.util.Arrays.mergeSort(Arrays.java:1270)
at java.util.Arrays.sort(Arrays.java:1210)
at com.google.common.collect.SortedIterables.sortedUnique(SortedIterables.java:95)
at com.google.common.collect.ImmutableSortedSet.copyOfInternal(ImmutableSortedSet.java:408)
at com.google.common.collect.ImmutableSortedSet.copyOf(ImmutableSortedSet.java:343)
at com.google.common.collect.ImmutableSortedSet.copyOf(ImmutableSortedSet.java:251)
at org.jclouds.util.Iterables2.concreteCopy(Iterables2.java:37)
at org.jclouds.elasticstack.compute.ElasticStackComputeServiceAdapter.listImages(ElasticStackComputeServiceAdapter.java:187)
at org.jclouds.compute.config.ComputeServiceAdapterContextModule$2.get(ComputeServiceAdapterContextModule.java:116)
at org.jclouds.compute.config.ComputeServiceAdapterContextModule$2.get(ComputeServiceAdapterContextModule.java:112)
at org.jclouds.collect.TransformingSetSupplier.get(TransformingSetSupplier.java:47)
at org.jclouds.collect.TransformingSetSupplier.get(TransformingSetSupplier.java:36)
at org.jclouds.compute.config.BaseComputeServiceContextModule$9.get(BaseComputeServiceContextModule.java:247)
at org.jclouds.compute.config.BaseComputeServiceContextModule$9.get(BaseComputeServiceContextModule.java:244)
at org.jclouds.rest.suppliers.SetAndThrowAuthorizationExceptionSupplier.get(SetAndThrowAuthorizationExceptionSupplier.java:49)
at org.jclouds.concurrent.RetryOnTimeOutExceptionSupplier.get(RetryOnTimeOutExceptionSupplier.java:47)
at org.jclouds.util.Suppliers2$ExpiringMemoizingSupplier.get(Suppliers2.java:130)
at org.jclouds.rest.suppliers.MemoizedRetryOnTimeOutButNotOnAuthorizationExceptionSupplier.get(MemoizedRetryOnTimeOutButNotOnAuthorizationExceptionSupplier.java:64)
at org.jclouds.compute.domain.internal.TemplateBuilderImpl.getImages(TemplateBuilderImpl.java:737)
at org.jclouds.compute.domain.internal.TemplateBuilderImpl.build(TemplateBuilderImpl.java:612)
at org.jclouds.compute.domain.internal.TemplateBuilderImpl.build(TemplateBuilderImpl.java:606)
at org.jclouds.compute.internal.BaseTemplateBuilderLiveTest.testFromTemplate(BaseTemplateBuilderLiveTest.java:92)
at sun.reflect.NativeMethodAccessorImpl.invoke0(Native Method)
at sun.reflect.NativeMethodAccessorImpl.invoke(NativeMethodAccessorImpl.java:39)
at sun.reflect.DelegatingMethodAccessorImpl.invoke(DelegatingMethodAccessorImpl.java:25)
at java.lang.reflect.Method.invoke(Method.java:597)
at org.testng.internal.MethodInvocationHelper.invokeMethod(MethodInvocationHelper.java:80)
at org.testng.internal.Invoker.invokeMethod(Invoker.java:701)
at org.testng.internal.Invoker.invokeTestMethod(Invoker.java:893)
at org.testng.internal.Invoker.invokeTestMethods(Invoker.java:1218)
at org.testng.internal.TestMethodWorker.invokeTestMethods(TestMethodWorker.java:127)
at org.testng.internal.TestMethodWorker.run(TestMethodWorker.java:111)
at org.testng.TestRunner.privateRun(TestRunner.java:758)
at org.testng.TestRunner.run(TestRunner.java:613)
at org.testng.SuiteRunner.runTest(SuiteRunner.java:334)
at org.testng.SuiteRunner.access$000(SuiteRunner.java:37)
at org.testng.SuiteRunner$SuiteWorker.run(SuiteRunner.java:368)
at org.testng.internal.thread.ThreadUtil$2.call(ThreadUtil.java:64)
at java.util.concurrent.FutureTask$Sync.innerRun(FutureTask.java:303)
at java.util.concurrent.FutureTask.run(FutureTask.java:138)
at java.util.concurrent.ThreadPoolExecutor$Worker.runTask(ThreadPoolExecutor.java:886)
at java.util.concurrent.ThreadPoolExecutor$Worker.run(ThreadPoolExecutor.java:908)
at java.lang.Thread.run(Thread.java:680)
testCompareSizes(org.jclouds.go2cloud.compute.Go2CloudJohannesburg1ComputeServiceLiveTest) Time elapsed: 0.59 sec <<< FAILURE!
java.lang.ClassCastException: org.jclouds.elasticstack.domain.DriveInfo cannot be cast to java.lang.Comparable
at com.google.common.collect.NaturalOrdering.compare(NaturalOrdering.java:28)
at java.util.Arrays.mergeSort(Arrays.java:1270)
at java.util.Arrays.sort(Arrays.java:1210)
at com.google.common.collect.SortedIterables.sortedUnique(SortedIterables.java:95)
at com.google.common.collect.ImmutableSortedSet.copyOfInternal(ImmutableSortedSet.java:408)
at com.google.common.collect.ImmutableSortedSet.copyOf(ImmutableSortedSet.java:343)
at com.google.common.collect.ImmutableSortedSet.copyOf(ImmutableSortedSet.java:251)
at org.jclouds.util.Iterables2.concreteCopy(Iterables2.java:37)
at org.jclouds.elasticstack.compute.ElasticStackComputeServiceAdapter.listImages(ElasticStackComputeServiceAdapter.java:187)
at org.jclouds.compute.config.ComputeServiceAdapterContextModule$2.get(ComputeServiceAdapterContextModule.java:116)
at org.jclouds.compute.config.ComputeServiceAdapterContextModule$2.get(ComputeServiceAdapterContextModule.java:112)
at org.jclouds.collect.TransformingSetSupplier.get(TransformingSetSupplier.java:47)
at org.jclouds.collect.TransformingSetSupplier.get(TransformingSetSupplier.java:36)
at org.jclouds.compute.config.BaseComputeServiceContextModule$9.get(BaseComputeServiceContextModule.java:247)
at org.jclouds.compute.config.BaseComputeServiceContextModule$9.get(BaseComputeServiceContextModule.java:244)
at org.jclouds.rest.suppliers.SetAndThrowAuthorizationExceptionSupplier.get(SetAndThrowAuthorizationExceptionSupplier.java:49)
at org.jclouds.concurrent.RetryOnTimeOutExceptionSupplier.get(RetryOnTimeOutExceptionSupplier.java:47)
at org.jclouds.util.Suppliers2$ExpiringMemoizingSupplier.get(Suppliers2.java:130)
at org.jclouds.rest.suppliers.MemoizedRetryOnTimeOutButNotOnAuthorizationExceptionSupplier.get(MemoizedRetryOnTimeOutButNotOnAuthorizationExceptionSupplier.java:64)
at org.jclouds.compute.domain.internal.TemplateBuilderImpl.getImages(TemplateBuilderImpl.java:737)
at org.jclouds.compute.domain.internal.TemplateBuilderImpl.build(TemplateBuilderImpl.java:612)
at org.jclouds.compute.domain.internal.TemplateBuilderImpl.build(TemplateBuilderImpl.java:606)
at org.jclouds.compute.internal.BaseComputeServiceLiveTest.testCompareSizes(BaseComputeServiceLiveTest.java:779)
at sun.reflect.NativeMethodAccessorImpl.invoke0(Native Method)
at sun.reflect.NativeMethodAccessorImpl.invoke(NativeMethodAccessorImpl.java:39)
at sun.reflect.DelegatingMethodAccessorImpl.invoke(DelegatingMethodAccessorImpl.java:25)
at java.lang.reflect.Method.invoke(Method.java:597)
at org.testng.internal.MethodInvocationHelper.invokeMethod(MethodInvocationHelper.java:80)
at org.testng.internal.Invoker.invokeMethod(Invoker.java:701)
at org.testng.internal.Invoker.invokeTestMethod(Invoker.java:893)
at org.testng.internal.Invoker.invokeTestMethods(Invoker.java:1218)
at org.testng.internal.TestMethodWorker.invokeTestMethods(TestMethodWorker.java:127)
at org.testng.internal.TestMethodWorker.run(TestMethodWorker.java:111)
at org.testng.TestRunner.privateRun(TestRunner.java:758)
at org.testng.TestRunner.run(TestRunner.java:613)
at org.testng.SuiteRunner.runTest(SuiteRunner.java:334)
at org.testng.SuiteRunner.access$000(SuiteRunner.java:37)
at org.testng.SuiteRunner$SuiteWorker.run(SuiteRunner.java:368)
at org.testng.internal.thread.ThreadUtil$2.call(ThreadUtil.java:64)
at java.util.concurrent.FutureTask$Sync.innerRun(FutureTask.java:303)
at java.util.concurrent.FutureTask.run(FutureTask.java:138)
at java.util.concurrent.ThreadPoolExecutor$Worker.runTask(ThreadPoolExecutor.java:886)
at java.util.concurrent.ThreadPoolExecutor$Worker.run(ThreadPoolExecutor.java:908)
at java.lang.Thread.run(Thread.java:680)
testTemplateBuilderCanFind(org.jclouds.go2cloud.compute.Go2CloudJohannesburg1TemplateBuilderLiveTest) Time elapsed: 0.281 sec <<< FAILURE!
java.lang.ClassCastException: org.jclouds.elasticstack.domain.DriveInfo cannot be cast to java.lang.Comparable
at com.google.common.collect.NaturalOrdering.compare(NaturalOrdering.java:28)
at java.util.Arrays.mergeSort(Arrays.java:1270)
at java.util.Arrays.sort(Arrays.java:1210)
at com.google.common.collect.SortedIterables.sortedUnique(SortedIterables.java:95)
at com.google.common.collect.ImmutableSortedSet.copyOfInternal(ImmutableSortedSet.java:408)
at com.google.common.collect.ImmutableSortedSet.copyOf(ImmutableSortedSet.java:343)
at com.google.common.collect.ImmutableSortedSet.copyOf(ImmutableSortedSet.java:251)
at org.jclouds.util.Iterables2.concreteCopy(Iterables2.java:37)
at org.jclouds.elasticstack.compute.ElasticStackComputeServiceAdapter.listImages(ElasticStackComputeServiceAdapter.java:187)
at org.jclouds.compute.config.ComputeServiceAdapterContextModule$2.get(ComputeServiceAdapterContextModule.java:116)
at org.jclouds.compute.config.ComputeServiceAdapterContextModule$2.get(ComputeServiceAdapterContextModule.java:112)
at org.jclouds.collect.TransformingSetSupplier.get(TransformingSetSupplier.java:47)
at org.jclouds.collect.TransformingSetSupplier.get(TransformingSetSupplier.java:36)
at org.jclouds.compute.config.BaseComputeServiceContextModule$9.get(BaseComputeServiceContextModule.java:247)
at org.jclouds.compute.config.BaseComputeServiceContextModule$9.get(BaseComputeServiceContextModule.java:244)
at org.jclouds.rest.suppliers.SetAndThrowAuthorizationExceptionSupplier.get(SetAndThrowAuthorizationExceptionSupplier.java:49)
at org.jclouds.concurrent.RetryOnTimeOutExceptionSupplier.get(RetryOnTimeOutExceptionSupplier.java:47)
at org.jclouds.util.Suppliers2$ExpiringMemoizingSupplier.get(Suppliers2.java:130)
at org.jclouds.rest.suppliers.MemoizedRetryOnTimeOutButNotOnAuthorizationExceptionSupplier.get(MemoizedRetryOnTimeOutButNotOnAuthorizationExceptionSupplier.java:64)
at org.jclouds.compute.domain.internal.TemplateBuilderImpl.getImages(TemplateBuilderImpl.java:737)
at org.jclouds.compute.domain.internal.TemplateBuilderImpl.build(TemplateBuilderImpl.java:612)
at org.jclouds.compute.internal.BaseTemplateBuilderLiveTest.testTemplateBuilderCanFind(BaseTemplateBuilderLiveTest.java:141)
at sun.reflect.NativeMethodAccessorImpl.invoke0(Native Method)
at sun.reflect.NativeMethodAccessorImpl.invoke(NativeMethodAccessorImpl.java:39)
at sun.reflect.DelegatingMethodAccessorImpl.invoke(DelegatingMethodAccessorImpl.java:25)
at java.lang.reflect.Method.invoke(Method.java:597)
at org.testng.internal.MethodInvocationHelper.invokeMethod(MethodInvocationHelper.java:80)
at org.testng.internal.Invoker.invokeMethod(Invoker.java:701)
at org.testng.internal.Invoker.invokeTestMethod(Invoker.java:893)
at org.testng.internal.Invoker.invokeTestMethods(Invoker.java:1218)
at org.testng.internal.TestMethodWorker.invokeTestMethods(TestMethodWorker.java:127)
at org.testng.internal.TestMethodWorker.run(TestMethodWorker.java:111)
at org.testng.TestRunner.privateRun(TestRunner.java:758)
at org.testng.TestRunner.run(TestRunner.java:613)
at org.testng.SuiteRunner.runTest(SuiteRunner.java:334)
at org.testng.SuiteRunner.access$000(SuiteRunner.java:37)
at org.testng.SuiteRunner$SuiteWorker.run(SuiteRunner.java:368)
at org.testng.internal.thread.ThreadUtil$2.call(ThreadUtil.java:64)
at java.util.concurrent.FutureTask$Sync.innerRun(FutureTask.java:303)
at java.util.concurrent.FutureTask.run(FutureTask.java:138)
at java.util.concurrent.ThreadPoolExecutor$Worker.runTask(ThreadPoolExecutor.java:886)
at java.util.concurrent.ThreadPoolExecutor$Worker.run(ThreadPoolExecutor.java:908)
at java.lang.Thread.run(Thread.java:680)
testTemplateBuilderCanFind(org.jclouds.go2cloud.compute.Go2CloudJohannesburg1TemplateBuilderLiveTest) Time elapsed: 1.137 sec <<< FAILURE!
java.lang.ClassCastException: org.jclouds.elasticstack.domain.DriveInfo cannot be cast to java.lang.Comparable
at com.google.common.collect.NaturalOrdering.compare(NaturalOrdering.java:28)
at java.util.Arrays.mergeSort(Arrays.java:1270)
at java.util.Arrays.sort(Arrays.java:1210)
at com.google.common.collect.SortedIterables.sortedUnique(SortedIterables.java:95)
at com.google.common.collect.ImmutableSortedSet.copyOfInternal(ImmutableSortedSet.java:408)
at com.google.common.collect.ImmutableSortedSet.copyOf(ImmutableSortedSet.java:343)
at com.google.common.collect.ImmutableSortedSet.copyOf(ImmutableSortedSet.java:251)
at org.jclouds.util.Iterables2.concreteCopy(Iterables2.java:37)
at org.jclouds.elasticstack.compute.ElasticStackComputeServiceAdapter.listImages(ElasticStackComputeServiceAdapter.java:187)
at org.jclouds.compute.config.ComputeServiceAdapterContextModule$2.get(ComputeServiceAdapterContextModule.java:116)
at org.jclouds.compute.config.ComputeServiceAdapterContextModule$2.get(ComputeServiceAdapterContextModule.java:112)
at org.jclouds.collect.TransformingSetSupplier.get(TransformingSetSupplier.java:47)
at org.jclouds.collect.TransformingSetSupplier.get(TransformingSetSupplier.java:36)
at org.jclouds.compute.config.BaseComputeServiceContextModule$9.get(BaseComputeServiceContextModule.java:247)
at org.jclouds.compute.config.BaseComputeServiceContextModule$9.get(BaseComputeServiceContextModule.java:244)
at org.jclouds.rest.suppliers.SetAndThrowAuthorizationExceptionSupplier.get(SetAndThrowAuthorizationExceptionSupplier.java:49)
at org.jclouds.concurrent.RetryOnTimeOutExceptionSupplier.get(RetryOnTimeOutExceptionSupplier.java:47)
at org.jclouds.util.Suppliers2$ExpiringMemoizingSupplier.get(Suppliers2.java:130)
at org.jclouds.rest.suppliers.MemoizedRetryOnTimeOutButNotOnAuthorizationExceptionSupplier.get(MemoizedRetryOnTimeOutButNotOnAuthorizationExceptionSupplier.java:64)
at org.jclouds.compute.domain.internal.TemplateBuilderImpl.getImages(TemplateBuilderImpl.java:737)
at org.jclouds.compute.domain.internal.TemplateBuilderImpl.build(TemplateBuilderImpl.java:612)
at org.jclouds.compute.internal.BaseTemplateBuilderLiveTest.testTemplateBuilderCanFind(BaseTemplateBuilderLiveTest.java:141)
at sun.reflect.NativeMethodAccessorImpl.invoke0(Native Method)
at sun.reflect.NativeMethodAccessorImpl.invoke(NativeMethodAccessorImpl.java:39)
at sun.reflect.DelegatingMethodAccessorImpl.invoke(DelegatingMethodAccessorImpl.java:25)
at java.lang.reflect.Method.invoke(Method.java:597)
at org.testng.internal.MethodInvocationHelper.invokeMethod(MethodInvocationHelper.java:80)
at org.testng.internal.Invoker.invokeMethod(Invoker.java:701)
at org.testng.internal.Invoker.invokeTestMethod(Invoker.java:893)
at org.testng.internal.Invoker.invokeTestMethods(Invoker.java:1218)
at org.testng.internal.TestMethodWorker.invokeTestMethods(TestMethodWorker.java:127)
at org.testng.internal.TestMethodWorker.run(TestMethodWorker.java:111)
at org.testng.TestRunner.privateRun(TestRunner.java:758)
at org.testng.TestRunner.run(TestRunner.java:613)
at org.testng.SuiteRunner.runTest(SuiteRunner.java:334)
at org.testng.SuiteRunner.access$000(SuiteRunner.java:37)
at org.testng.SuiteRunner$SuiteWorker.run(SuiteRunner.java:368)
at org.testng.internal.thread.ThreadUtil$2.call(ThreadUtil.java:64)
at java.util.concurrent.FutureTask$Sync.innerRun(FutureTask.java:303)
at java.util.concurrent.FutureTask.run(FutureTask.java:138)
at java.util.concurrent.ThreadPoolExecutor$Worker.runTask(ThreadPoolExecutor.java:886)
at java.util.concurrent.ThreadPoolExecutor$Worker.run(ThreadPoolExecutor.java:908)
at java.lang.Thread.run(Thread.java:680)
testTemplateBuilderCanFind(org.jclouds.go2cloud.compute.Go2CloudJohannesburg1TemplateBuilderLiveTest) Time elapsed: 0.919 sec <<< FAILURE!
java.lang.ClassCastException: org.jclouds.elasticstack.domain.DriveInfo cannot be cast to java.lang.Comparable
at com.google.common.collect.NaturalOrdering.compare(NaturalOrdering.java:28)
at java.util.Arrays.mergeSort(Arrays.java:1270)
at java.util.Arrays.sort(Arrays.java:1210)
at com.google.common.collect.SortedIterables.sortedUnique(SortedIterables.java:95)
at com.google.common.collect.ImmutableSortedSet.copyOfInternal(ImmutableSortedSet.java:408)
at com.google.common.collect.ImmutableSortedSet.copyOf(ImmutableSortedSet.java:343)
at com.google.common.collect.ImmutableSortedSet.copyOf(ImmutableSortedSet.java:251)
at org.jclouds.util.Iterables2.concreteCopy(Iterables2.java:37)
at org.jclouds.elasticstack.compute.ElasticStackComputeServiceAdapter.listImages(ElasticStackComputeServiceAdapter.java:187)
at org.jclouds.compute.config.ComputeServiceAdapterContextModule$2.get(ComputeServiceAdapterContextModule.java:116)
at org.jclouds.compute.config.ComputeServiceAdapterContextModule$2.get(ComputeServiceAdapterContextModule.java:112)
at org.jclouds.collect.TransformingSetSupplier.get(TransformingSetSupplier.java:47)
at org.jclouds.collect.TransformingSetSupplier.get(TransformingSetSupplier.java:36)
at org.jclouds.compute.config.BaseComputeServiceContextModule$9.get(BaseComputeServiceContextModule.java:247)
at org.jclouds.compute.config.BaseComputeServiceContextModule$9.get(BaseComputeServiceContextModule.java:244)
at org.jclouds.rest.suppliers.SetAndThrowAuthorizationExceptionSupplier.get(SetAndThrowAuthorizationExceptionSupplier.java:49)
at org.jclouds.concurrent.RetryOnTimeOutExceptionSupplier.get(RetryOnTimeOutExceptionSupplier.java:47)
at org.jclouds.util.Suppliers2$ExpiringMemoizingSupplier.get(Suppliers2.java:130)
at org.jclouds.rest.suppliers.MemoizedRetryOnTimeOutButNotOnAuthorizationExceptionSupplier.get(MemoizedRetryOnTimeOutButNotOnAuthorizationExceptionSupplier.java:64)
at org.jclouds.compute.domain.internal.TemplateBuilderImpl.getImages(TemplateBuilderImpl.java:737)
at org.jclouds.compute.domain.internal.TemplateBuilderImpl.build(TemplateBuilderImpl.java:612)
at org.jclouds.compute.internal.BaseTemplateBuilderLiveTest.testTemplateBuilderCanFind(BaseTemplateBuilderLiveTest.java:141)
at sun.reflect.NativeMethodAccessorImpl.invoke0(Native Method)
at sun.reflect.NativeMethodAccessorImpl.invoke(NativeMethodAccessorImpl.java:39)
at sun.reflect.DelegatingMethodAccessorImpl.invoke(DelegatingMethodAccessorImpl.java:25)
at java.lang.reflect.Method.invoke(Method.java:597)
at org.testng.internal.MethodInvocationHelper.invokeMethod(MethodInvocationHelper.java:80)
at org.testng.internal.Invoker.invokeMethod(Invoker.java:701)
at org.testng.internal.Invoker.invokeTestMethod(Invoker.java:893)
at org.testng.internal.Invoker.invokeTestMethods(Invoker.java:1218)
at org.testng.internal.TestMethodWorker.invokeTestMethods(TestMethodWorker.java:127)
at org.testng.internal.TestMethodWorker.run(TestMethodWorker.java:111)
at org.testng.TestRunner.privateRun(TestRunner.java:758)
at org.testng.TestRunner.run(TestRunner.java:613)
at org.testng.SuiteRunner.runTest(SuiteRunner.java:334)
at org.testng.SuiteRunner.access$000(SuiteRunner.java:37)
at org.testng.SuiteRunner$SuiteWorker.run(SuiteRunner.java:368)
at org.testng.internal.thread.ThreadUtil$2.call(ThreadUtil.java:64)
at java.util.concurrent.FutureTask$Sync.innerRun(FutureTask.java:303)
at java.util.concurrent.FutureTask.run(FutureTask.java:138)
at java.util.concurrent.ThreadPoolExecutor$Worker.runTask(ThreadPoolExecutor.java:886)
at java.util.concurrent.ThreadPoolExecutor$Worker.run(ThreadPoolExecutor.java:908)
at java.lang.Thread.run(Thread.java:680)
testTemplateBuilderCanFind(org.jclouds.go2cloud.compute.Go2CloudJohannesburg1TemplateBuilderLiveTest) Time elapsed: 0.931 sec <<< FAILURE!
java.lang.ClassCastException: org.jclouds.elasticstack.domain.DriveInfo cannot be cast to java.lang.Comparable
at com.google.common.collect.NaturalOrdering.compare(NaturalOrdering.java:28)
at java.util.Arrays.mergeSort(Arrays.java:1270)
at java.util.Arrays.sort(Arrays.java:1210)
at com.google.common.collect.SortedIterables.sortedUnique(SortedIterables.java:95)
at com.google.common.collect.ImmutableSortedSet.copyOfInternal(ImmutableSortedSet.java:408)
at com.google.common.collect.ImmutableSortedSet.copyOf(ImmutableSortedSet.java:343)
at com.google.common.collect.ImmutableSortedSet.copyOf(ImmutableSortedSet.java:251)
at org.jclouds.util.Iterables2.concreteCopy(Iterables2.java:37)
at org.jclouds.elasticstack.compute.ElasticStackComputeServiceAdapter.listImages(ElasticStackComputeServiceAdapter.java:187)
at org.jclouds.compute.config.ComputeServiceAdapterContextModule$2.get(ComputeServiceAdapterContextModule.java:116)
at org.jclouds.compute.config.ComputeServiceAdapterContextModule$2.get(ComputeServiceAdapterContextModule.java:112)
at org.jclouds.collect.TransformingSetSupplier.get(TransformingSetSupplier.java:47)
at org.jclouds.collect.TransformingSetSupplier.get(TransformingSetSupplier.java:36)
at org.jclouds.compute.config.BaseComputeServiceContextModule$9.get(BaseComputeServiceContextModule.java:247)
at org.jclouds.compute.config.BaseComputeServiceContextModule$9.get(BaseComputeServiceContextModule.java:244)
at org.jclouds.rest.suppliers.SetAndThrowAuthorizationExceptionSupplier.get(SetAndThrowAuthorizationExceptionSupplier.java:49)
at org.jclouds.concurrent.RetryOnTimeOutExceptionSupplier.get(RetryOnTimeOutExceptionSupplier.java:47)
at org.jclouds.util.Suppliers2$ExpiringMemoizingSupplier.get(Suppliers2.java:130)
at org.jclouds.rest.suppliers.MemoizedRetryOnTimeOutButNotOnAuthorizationExceptionSupplier.get(MemoizedRetryOnTimeOutButNotOnAuthorizationExceptionSupplier.java:64)
at org.jclouds.compute.domain.internal.TemplateBuilderImpl.getImages(TemplateBuilderImpl.java:737)
at org.jclouds.compute.domain.internal.TemplateBuilderImpl.build(TemplateBuilderImpl.java:612)
at org.jclouds.compute.internal.BaseTemplateBuilderLiveTest.testTemplateBuilderCanFind(BaseTemplateBuilderLiveTest.java:141)
at sun.reflect.NativeMethodAccessorImpl.invoke0(Native Method)
at sun.reflect.NativeMethodAccessorImpl.invoke(NativeMethodAccessorImpl.java:39)
at sun.reflect.DelegatingMethodAccessorImpl.invoke(DelegatingMethodAccessorImpl.java:25)
at java.lang.reflect.Method.invoke(Method.java:597)
at org.testng.internal.MethodInvocationHelper.invokeMethod(MethodInvocationHelper.java:80)
at org.testng.internal.Invoker.invokeMethod(Invoker.java:701)
at org.testng.internal.Invoker.invokeTestMethod(Invoker.java:893)
at org.testng.internal.Invoker.invokeTestMethods(Invoker.java:1218)
at org.testng.internal.TestMethodWorker.invokeTestMethods(TestMethodWorker.java:127)
at org.testng.internal.TestMethodWorker.run(TestMethodWorker.java:111)
at org.testng.TestRunner.privateRun(TestRunner.java:758)
at org.testng.TestRunner.run(TestRunner.java:613)
at org.testng.SuiteRunner.runTest(SuiteRunner.java:334)
at org.testng.SuiteRunner.access$000(SuiteRunner.java:37)
at org.testng.SuiteRunner$SuiteWorker.run(SuiteRunner.java:368)
at org.testng.internal.thread.ThreadUtil$2.call(ThreadUtil.java:64)
at java.util.concurrent.FutureTask$Sync.innerRun(FutureTask.java:303)
at java.util.concurrent.FutureTask.run(FutureTask.java:138)
at java.util.concurrent.ThreadPoolExecutor$Worker.runTask(ThreadPoolExecutor.java:886)
at java.util.concurrent.ThreadPoolExecutor$Worker.run(ThreadPoolExecutor.java:908)
at java.lang.Thread.run(Thread.java:680)
testTemplateBuilderCanFind(org.jclouds.go2cloud.compute.Go2CloudJohannesburg1TemplateBuilderLiveTest) Time elapsed: 1.102 sec <<< FAILURE!
java.lang.ClassCastException: org.jclouds.elasticstack.domain.DriveInfo cannot be cast to java.lang.Comparable
at com.google.common.collect.NaturalOrdering.compare(NaturalOrdering.java:28)
at java.util.Arrays.mergeSort(Arrays.java:1270)
at java.util.Arrays.sort(Arrays.java:1210)
at com.google.common.collect.SortedIterables.sortedUnique(SortedIterables.java:95)
at com.google.common.collect.ImmutableSortedSet.copyOfInternal(ImmutableSortedSet.java:408)
at com.google.common.collect.ImmutableSortedSet.copyOf(ImmutableSortedSet.java:343)
at com.google.common.collect.ImmutableSortedSet.copyOf(ImmutableSortedSet.java:251)
at org.jclouds.util.Iterables2.concreteCopy(Iterables2.java:37)
at org.jclouds.elasticstack.compute.ElasticStackComputeServiceAdapter.listImages(ElasticStackComputeServiceAdapter.java:187)
at org.jclouds.compute.config.ComputeServiceAdapterContextModule$2.get(ComputeServiceAdapterContextModule.java:116)
at org.jclouds.compute.config.ComputeServiceAdapterContextModule$2.get(ComputeServiceAdapterContextModule.java:112)
at org.jclouds.collect.TransformingSetSupplier.get(TransformingSetSupplier.java:47)
at org.jclouds.collect.TransformingSetSupplier.get(TransformingSetSupplier.java:36)
at org.jclouds.compute.config.BaseComputeServiceContextModule$9.get(BaseComputeServiceContextModule.java:247)
at org.jclouds.compute.config.BaseComputeServiceContextModule$9.get(BaseComputeServiceContextModule.java:244)
at org.jclouds.rest.suppliers.SetAndThrowAuthorizationExceptionSupplier.get(SetAndThrowAuthorizationExceptionSupplier.java:49)
at org.jclouds.concurrent.RetryOnTimeOutExceptionSupplier.get(RetryOnTimeOutExceptionSupplier.java:47)
at org.jclouds.util.Suppliers2$ExpiringMemoizingSupplier.get(Suppliers2.java:130)
at org.jclouds.rest.suppliers.MemoizedRetryOnTimeOutButNotOnAuthorizationExceptionSupplier.get(MemoizedRetryOnTimeOutButNotOnAuthorizationExceptionSupplier.java:64)
at org.jclouds.compute.domain.internal.TemplateBuilderImpl.getImages(TemplateBuilderImpl.java:737)
at org.jclouds.compute.domain.internal.TemplateBuilderImpl.build(TemplateBuilderImpl.java:612)
at org.jclouds.compute.internal.BaseTemplateBuilderLiveTest.testTemplateBuilderCanFind(BaseTemplateBuilderLiveTest.java:141)
at sun.reflect.NativeMethodAccessorImpl.invoke0(Native Method)
at sun.reflect.NativeMethodAccessorImpl.invoke(NativeMethodAccessorImpl.java:39)
at sun.reflect.DelegatingMethodAccessorImpl.invoke(DelegatingMethodAccessorImpl.java:25)
at java.lang.reflect.Method.invoke(Method.java:597)
at org.testng.internal.MethodInvocationHelper.invokeMethod(MethodInvocationHelper.java:80)
at org.testng.internal.Invoker.invokeMethod(Invoker.java:701)
at org.testng.internal.Invoker.invokeTestMethod(Invoker.java:893)
at org.testng.internal.Invoker.invokeTestMethods(Invoker.java:1218)
at org.testng.internal.TestMethodWorker.invokeTestMethods(TestMethodWorker.java:127)
at org.testng.internal.TestMethodWorker.run(TestMethodWorker.java:111)
at org.testng.TestRunner.privateRun(TestRunner.java:758)
at org.testng.TestRunner.run(TestRunner.java:613)
at org.testng.SuiteRunner.runTest(SuiteRunner.java:334)
at org.testng.SuiteRunner.access$000(SuiteRunner.java:37)
at org.testng.SuiteRunner$SuiteWorker.run(SuiteRunner.java:368)
at org.testng.internal.thread.ThreadUtil$2.call(ThreadUtil.java:64)
at java.util.concurrent.FutureTask$Sync.innerRun(FutureTask.java:303)
at java.util.concurrent.FutureTask.run(FutureTask.java:138)
at java.util.concurrent.ThreadPoolExecutor$Worker.runTask(ThreadPoolExecutor.java:886)
at java.util.concurrent.ThreadPoolExecutor$Worker.run(ThreadPoolExecutor.java:908)
at java.lang.Thread.run(Thread.java:680)
testCorrectAuthException(org.jclouds.go2cloud.compute.Go2CloudJohannesburg1ComputeServiceLiveTest) Time elapsed: 1.45 sec <<< FAILURE!
org.testng.TestException:
Expected exception org.jclouds.rest.AuthorizationException but got java.lang.ClassCastException: org.jclouds.elasticstack.domain.DriveInfo cannot be cast to java.lang.Comparable
at org.testng.internal.Invoker.handleInvocationResults(Invoker.java:1475)
at org.testng.internal.Invoker.invokeMethod(Invoker.java:750)
at org.testng.internal.Invoker.invokeTestMethod(Invoker.java:893)
at org.testng.internal.Invoker.invokeTestMethods(Invoker.java:1218)
at org.testng.internal.TestMethodWorker.invokeTestMethods(TestMethodWorker.java:127)
at org.testng.internal.TestMethodWorker.run(TestMethodWorker.java:111)
at org.testng.TestRunner.privateRun(TestRunner.java:758)
at org.testng.TestRunner.run(TestRunner.java:613)
at org.testng.SuiteRunner.runTest(SuiteRunner.java:334)
at org.testng.SuiteRunner.access$000(SuiteRunner.java:37)
at org.testng.SuiteRunner$SuiteWorker.run(SuiteRunner.java:368)
at org.testng.internal.thread.ThreadUtil$2.call(ThreadUtil.java:64)
at java.util.concurrent.FutureTask$Sync.innerRun(FutureTask.java:303)
at java.util.concurrent.FutureTask.run(FutureTask.java:138)
at java.util.concurrent.ThreadPoolExecutor$Worker.runTask(ThreadPoolExecutor.java:886)
at java.util.concurrent.ThreadPoolExecutor$Worker.run(ThreadPoolExecutor.java:908)
at java.lang.Thread.run(Thread.java:680)
Caused by: java.lang.ClassCastException: org.jclouds.elasticstack.domain.DriveInfo cannot be cast to java.lang.Comparable
at com.google.common.collect.NaturalOrdering.compare(NaturalOrdering.java:28)
at java.util.Arrays.mergeSort(Arrays.java:1270)
at java.util.Arrays.sort(Arrays.java:1210)
at com.google.common.collect.SortedIterables.sortedUnique(SortedIterables.java:95)
at com.google.common.collect.ImmutableSortedSet.copyOfInternal(ImmutableSortedSet.java:408)
at com.google.common.collect.ImmutableSortedSet.copyOf(ImmutableSortedSet.java:343)
at com.google.common.collect.ImmutableSortedSet.copyOf(ImmutableSortedSet.java:251)
at org.jclouds.util.Iterables2.concreteCopy(Iterables2.java:37)
at org.jclouds.elasticstack.compute.ElasticStackComputeServiceAdapter.listImages(ElasticStackComputeServiceAdapter.java:187)
at org.jclouds.compute.config.ComputeServiceAdapterContextModule$2.get(ComputeServiceAdapterContextModule.java:116)
at org.jclouds.compute.config.ComputeServiceAdapterContextModule$2.get(ComputeServiceAdapterContextModule.java:112)
at org.jclouds.collect.TransformingSetSupplier.get(TransformingSetSupplier.java:47)
at org.jclouds.collect.TransformingSetSupplier.get(TransformingSetSupplier.java:36)
at org.jclouds.compute.config.BaseComputeServiceContextModule$9.get(BaseComputeServiceContextModule.java:247)
at org.jclouds.compute.config.BaseComputeServiceContextModule$9.get(BaseComputeServiceContextModule.java:244)
at org.jclouds.rest.suppliers.SetAndThrowAuthorizationExceptionSupplier.get(SetAndThrowAuthorizationExceptionSupplier.java:49)
at org.jclouds.concurrent.RetryOnTimeOutExceptionSupplier.get(RetryOnTimeOutExceptionSupplier.java:47)
at org.jclouds.util.Suppliers2$ExpiringMemoizingSupplier.get(Suppliers2.java:130)
at org.jclouds.rest.suppliers.MemoizedRetryOnTimeOutButNotOnAuthorizationExceptionSupplier.get(MemoizedRetryOnTimeOutButNotOnAuthorizationExceptionSupplier.java:64)
at org.jclouds.collect.FindResourceInSet.apply(FindResourceInSet.java:56)
at org.jclouds.elasticstack.compute.functions.ServerInfoToNodeMetadata.apply(ServerInfoToNodeMetadata.java:101)
at org.jclouds.elasticstack.compute.functions.ServerInfoToNodeMetadata.apply(ServerInfoToNodeMetadata.java:62)
at com.google.common.base.Functions$FunctionComposition.apply(Functions.java:209)
at com.google.common.collect.Iterators$9.transform(Iterators.java:845)
at com.google.common.collect.TransformedIterator.next(TransformedIterator.java:48)
at com.google.common.collect.Iterators$8.computeNext(Iterators.java:687)
at com.google.common.collect.AbstractIterator.tryToComputeNext(AbstractIterator.java:143)
at com.google.common.collect.AbstractIterator.hasNext(AbstractIterator.java:138)
at com.google.common.collect.Sets.newLinkedHashSet(Sets.java:290)
at org.jclouds.compute.internal.BaseComputeService.listNodes(BaseComputeService.java:334)
at org.jclouds.compute.internal.BaseComputeServiceLiveTest.testCorrectAuthException(BaseComputeServiceLiveTest.java:177)
at sun.reflect.NativeMethodAccessorImpl.invoke0(Native Method)
at sun.reflect.NativeMethodAccessorImpl.invoke(NativeMethodAccessorImpl.java:39)
at sun.reflect.DelegatingMethodAccessorImpl.invoke(DelegatingMethodAccessorImpl.java:25)
at java.lang.reflect.Method.invoke(Method.java:597)
at org.testng.internal.MethodInvocationHelper.invokeMethod(MethodInvocationHelper.java:80)
at org.testng.internal.Invoker.invokeMethod(Invoker.java:701)
... 15 more
Caused by: java.lang.ClassCastException: org.jclouds.elasticstack.domain.DriveInfo cannot be cast to java.lang.Comparable
at com.google.common.collect.NaturalOrdering.compare(NaturalOrdering.java:28)
at java.util.Arrays.mergeSort(Arrays.java:1270)
at java.util.Arrays.sort(Arrays.java:1210)
at com.google.common.collect.SortedIterables.sortedUnique(SortedIterables.java:95)
at com.google.common.collect.ImmutableSortedSet.copyOfInternal(ImmutableSortedSet.java:408)
at com.google.common.collect.ImmutableSortedSet.copyOf(ImmutableSortedSet.java:343)
at com.google.common.collect.ImmutableSortedSet.copyOf(ImmutableSortedSet.java:251)
at org.jclouds.util.Iterables2.concreteCopy(Iterables2.java:37)
at org.jclouds.elasticstack.compute.ElasticStackComputeServiceAdapter.listImages(ElasticStackComputeServiceAdapter.java:187)
at org.jclouds.compute.config.ComputeServiceAdapterContextModule$2.get(ComputeServiceAdapterContextModule.java:116)
at org.jclouds.compute.config.ComputeServiceAdapterContextModule$2.get(ComputeServiceAdapterContextModule.java:112)
at org.jclouds.collect.TransformingSetSupplier.get(TransformingSetSupplier.java:47)
at org.jclouds.collect.TransformingSetSupplier.get(TransformingSetSupplier.java:36)
at org.jclouds.compute.config.BaseComputeServiceContextModule$9.get(BaseComputeServiceContextModule.java:247)
at org.jclouds.compute.config.BaseComputeServiceContextModule$9.get(BaseComputeServiceContextModule.java:244)
at org.jclouds.rest.suppliers.SetAndThrowAuthorizationExceptionSupplier.get(SetAndThrowAuthorizationExceptionSupplier.java:49)
at org.jclouds.concurrent.RetryOnTimeOutExceptionSupplier.get(RetryOnTimeOutExceptionSupplier.java:47)
at org.jclouds.util.Suppliers2$ExpiringMemoizingSupplier.get(Suppliers2.java:130)
at org.jclouds.rest.suppliers.MemoizedRetryOnTimeOutButNotOnAuthorizationExceptionSupplier.get(MemoizedRetryOnTimeOutButNotOnAuthorizationExceptionSupplier.java:64)
at org.jclouds.collect.FindResourceInSet.apply(FindResourceInSet.java:56)
at org.jclouds.elasticstack.compute.functions.ServerInfoToNodeMetadata.apply(ServerInfoToNodeMetadata.java:101)
at org.jclouds.elasticstack.compute.functions.ServerInfoToNodeMetadata.apply(ServerInfoToNodeMetadata.java:62)
at com.google.common.base.Functions$FunctionComposition.apply(Functions.java:209)
at com.google.common.collect.Iterators$9.transform(Iterators.java:845)
at com.google.common.collect.TransformedIterator.next(TransformedIterator.java:48)
at com.google.common.collect.Iterators$8.computeNext(Iterators.java:687)
at com.google.common.collect.AbstractIterator.tryToComputeNext(AbstractIterator.java:143)
at com.google.common.collect.AbstractIterator.hasNext(AbstractIterator.java:138)
at com.google.common.collect.Sets.newLinkedHashSet(Sets.java:290)
at org.jclouds.compute.internal.BaseComputeService.listNodes(BaseComputeService.java:334)
at org.jclouds.compute.internal.BaseComputeServiceLiveTest.testCorrectAuthException(BaseComputeServiceLiveTest.java:177)
at sun.reflect.NativeMethodAccessorImpl.invoke0(Native Method)
at sun.reflect.NativeMethodAccessorImpl.invoke(NativeMethodAccessorImpl.java:39)
at sun.reflect.DelegatingMethodAccessorImpl.invoke(DelegatingMethodAccessorImpl.java:25)
at java.lang.reflect.Method.invoke(Method.java:597)
at org.testng.internal.MethodInvocationHelper.invokeMethod(MethodInvocationHelper.java:80)
at org.testng.internal.Invoker.invokeMethod(Invoker.java:701)
... 15 more
testTemplateBuilderCanUseImageId(org.jclouds.go2cloud.compute.Go2CloudJohannesburg1TemplateBuilderLiveTest) Time elapsed: 0.2 sec <<< FAILURE!
java.lang.ClassCastException: org.jclouds.elasticstack.domain.DriveInfo cannot be cast to java.lang.Comparable
at com.google.common.collect.NaturalOrdering.compare(NaturalOrdering.java:28)
at java.util.Arrays.mergeSort(Arrays.java:1270)
at java.util.Arrays.sort(Arrays.java:1210)
at com.google.common.collect.SortedIterables.sortedUnique(SortedIterables.java:95)
at com.google.common.collect.ImmutableSortedSet.copyOfInternal(ImmutableSortedSet.java:408)
at com.google.common.collect.ImmutableSortedSet.copyOf(ImmutableSortedSet.java:343)
at com.google.common.collect.ImmutableSortedSet.copyOf(ImmutableSortedSet.java:251)
at org.jclouds.util.Iterables2.concreteCopy(Iterables2.java:37)
at org.jclouds.elasticstack.compute.ElasticStackComputeServiceAdapter.listImages(ElasticStackComputeServiceAdapter.java:187)
at org.jclouds.compute.config.ComputeServiceAdapterContextModule$2.get(ComputeServiceAdapterContextModule.java:116)
at org.jclouds.compute.config.ComputeServiceAdapterContextModule$2.get(ComputeServiceAdapterContextModule.java:112)
at org.jclouds.collect.TransformingSetSupplier.get(TransformingSetSupplier.java:47)
at org.jclouds.collect.TransformingSetSupplier.get(TransformingSetSupplier.java:36)
at org.jclouds.compute.config.BaseComputeServiceContextModule$9.get(BaseComputeServiceContextModule.java:247)
at org.jclouds.compute.config.BaseComputeServiceContextModule$9.get(BaseComputeServiceContextModule.java:244)
at org.jclouds.rest.suppliers.SetAndThrowAuthorizationExceptionSupplier.get(SetAndThrowAuthorizationExceptionSupplier.java:49)
at org.jclouds.concurrent.RetryOnTimeOutExceptionSupplier.get(RetryOnTimeOutExceptionSupplier.java:47)
at org.jclouds.util.Suppliers2$ExpiringMemoizingSupplier.get(Suppliers2.java:130)
at org.jclouds.rest.suppliers.MemoizedRetryOnTimeOutButNotOnAuthorizationExceptionSupplier.get(MemoizedRetryOnTimeOutButNotOnAuthorizationExceptionSupplier.java:64)
at org.jclouds.compute.domain.internal.TemplateBuilderImpl.getImages(TemplateBuilderImpl.java:737)
at org.jclouds.compute.domain.internal.TemplateBuilderImpl.build(TemplateBuilderImpl.java:612)
at org.jclouds.compute.domain.internal.TemplateBuilderImpl.build(TemplateBuilderImpl.java:606)
at org.jclouds.compute.internal.BaseTemplateBuilderLiveTest.testTemplateBuilderCanUseImageId(BaseTemplateBuilderLiveTest.java:159)
at sun.reflect.NativeMethodAccessorImpl.invoke0(Native Method)
at sun.reflect.NativeMethodAccessorImpl.invoke(NativeMethodAccessorImpl.java:39)
at sun.reflect.DelegatingMethodAccessorImpl.invoke(DelegatingMethodAccessorImpl.java:25)
at java.lang.reflect.Method.invoke(Method.java:597)
at org.testng.internal.MethodInvocationHelper.invokeMethod(MethodInvocationHelper.java:80)
at org.testng.internal.Invoker.invokeMethod(Invoker.java:701)
at org.testng.internal.Invoker.invokeTestMethod(Invoker.java:893)
at org.testng.internal.Invoker.invokeTestMethods(Invoker.java:1218)
at org.testng.internal.TestMethodWorker.invokeTestMethods(TestMethodWorker.java:127)
at org.testng.internal.TestMethodWorker.run(TestMethodWorker.java:111)
at org.testng.TestRunner.privateRun(TestRunner.java:758)
at org.testng.TestRunner.run(TestRunner.java:613)
at org.testng.SuiteRunner.runTest(SuiteRunner.java:334)
at org.testng.SuiteRunner.access$000(SuiteRunner.java:37)
at org.testng.SuiteRunner$SuiteWorker.run(SuiteRunner.java:368)
at org.testng.internal.thread.ThreadUtil$2.call(ThreadUtil.java:64)
at java.util.concurrent.FutureTask$Sync.innerRun(FutureTask.java:303)
at java.util.concurrent.FutureTask.run(FutureTask.java:138)
at java.util.concurrent.ThreadPoolExecutor$Worker.runTask(ThreadPoolExecutor.java:886)
at java.util.concurrent.ThreadPoolExecutor$Worker.run(ThreadPoolExecutor.java:908)
at java.lang.Thread.run(Thread.java:680)
testTemplateBuilderCannotFind(org.jclouds.go2cloud.compute.Go2CloudJohannesburg1TemplateBuilderLiveTest) Time elapsed: 0.907 sec <<< FAILURE!
org.testng.TestException:
Expected exception java.util.NoSuchElementException but got java.lang.ClassCastException: org.jclouds.elasticstack.domain.DriveInfo cannot be cast to java.lang.Comparable
at org.testng.internal.Invoker.handleInvocationResults(Invoker.java:1475)
at org.testng.internal.Invoker.invokeMethod(Invoker.java:750)
at org.testng.internal.Invoker.invokeTestMethod(Invoker.java:893)
at org.testng.internal.Invoker.invokeTestMethods(Invoker.java:1218)
at org.testng.internal.TestMethodWorker.invokeTestMethods(TestMethodWorker.java:127)
at org.testng.internal.TestMethodWorker.run(TestMethodWorker.java:111)
at org.testng.TestRunner.privateRun(TestRunner.java:758)
at org.testng.TestRunner.run(TestRunner.java:613)
at org.testng.SuiteRunner.runTest(SuiteRunner.java:334)
at org.testng.SuiteRunner.access$000(SuiteRunner.java:37)
at org.testng.SuiteRunner$SuiteWorker.run(SuiteRunner.java:368)
at org.testng.internal.thread.ThreadUtil$2.call(ThreadUtil.java:64)
at java.util.concurrent.FutureTask$Sync.innerRun(FutureTask.java:303)
at java.util.concurrent.FutureTask.run(FutureTask.java:138)
at java.util.concurrent.ThreadPoolExecutor$Worker.runTask(ThreadPoolExecutor.java:886)
at java.util.concurrent.ThreadPoolExecutor$Worker.run(ThreadPoolExecutor.java:908)
at java.lang.Thread.run(Thread.java:680)
Caused by: java.lang.ClassCastException: org.jclouds.elasticstack.domain.DriveInfo cannot be cast to java.lang.Comparable
at com.google.common.collect.NaturalOrdering.compare(NaturalOrdering.java:28)
at java.util.Arrays.mergeSort(Arrays.java:1270)
at java.util.Arrays.sort(Arrays.java:1210)
at com.google.common.collect.SortedIterables.sortedUnique(SortedIterables.java:95)
at com.google.common.collect.ImmutableSortedSet.copyOfInternal(ImmutableSortedSet.java:408)
at com.google.common.collect.ImmutableSortedSet.copyOf(ImmutableSortedSet.java:343)
at com.google.common.collect.ImmutableSortedSet.copyOf(ImmutableSortedSet.java:251)
at org.jclouds.util.Iterables2.concreteCopy(Iterables2.java:37)
at org.jclouds.elasticstack.compute.ElasticStackComputeServiceAdapter.listImages(ElasticStackComputeServiceAdapter.java:187)
at org.jclouds.compute.config.ComputeServiceAdapterContextModule$2.get(ComputeServiceAdapterContextModule.java:116)
at org.jclouds.compute.config.ComputeServiceAdapterContextModule$2.get(ComputeServiceAdapterContextModule.java:112)
at org.jclouds.collect.TransformingSetSupplier.get(TransformingSetSupplier.java:47)
at org.jclouds.collect.TransformingSetSupplier.get(TransformingSetSupplier.java:36)
at org.jclouds.compute.config.BaseComputeServiceContextModule$9.get(BaseComputeServiceContextModule.java:247)
at org.jclouds.compute.config.BaseComputeServiceContextModule$9.get(BaseComputeServiceContextModule.java:244)
at org.jclouds.rest.suppliers.SetAndThrowAuthorizationExceptionSupplier.get(SetAndThrowAuthorizationExceptionSupplier.java:49)
at org.jclouds.concurrent.RetryOnTimeOutExceptionSupplier.get(RetryOnTimeOutExceptionSupplier.java:47)
at org.jclouds.util.Suppliers2$ExpiringMemoizingSupplier.get(Suppliers2.java:130)
at org.jclouds.rest.suppliers.MemoizedRetryOnTimeOutButNotOnAuthorizationExceptionSupplier.get(MemoizedRetryOnTimeOutButNotOnAuthorizationExceptionSupplier.java:64)
at org.jclouds.compute.domain.internal.TemplateBuilderImpl.getImages(TemplateBuilderImpl.java:737)
at org.jclouds.compute.domain.internal.TemplateBuilderImpl.build(TemplateBuilderImpl.java:612)
at org.jclouds.compute.internal.BaseTemplateBuilderLiveTest.testTemplateBuilderCannotFind(BaseTemplateBuilderLiveTest.java:154)
at sun.reflect.NativeMethodAccessorImpl.invoke0(Native Method)
at sun.reflect.NativeMethodAccessorImpl.invoke(NativeMethodAccessorImpl.java:39)
at sun.reflect.DelegatingMethodAccessorImpl.invoke(DelegatingMethodAccessorImpl.java:25)
at java.lang.reflect.Method.invoke(Method.java:597)
at org.testng.internal.MethodInvocationHelper.invokeMethod(MethodInvocationHelper.java:80)
at org.testng.internal.Invoker.invokeMethod(Invoker.java:701)
... 15 more
Caused by: java.lang.ClassCastException: org.jclouds.elasticstack.domain.DriveInfo cannot be cast to java.lang.Comparable
at com.google.common.collect.NaturalOrdering.compare(NaturalOrdering.java:28)
at java.util.Arrays.mergeSort(Arrays.java:1270)
at java.util.Arrays.sort(Arrays.java:1210)
at com.google.common.collect.SortedIterables.sortedUnique(SortedIterables.java:95)
at com.google.common.collect.ImmutableSortedSet.copyOfInternal(ImmutableSortedSet.java:408)
at com.google.common.collect.ImmutableSortedSet.copyOf(ImmutableSortedSet.java:343)
at com.google.common.collect.ImmutableSortedSet.copyOf(ImmutableSortedSet.java:251)
at org.jclouds.util.Iterables2.concreteCopy(Iterables2.java:37)
at org.jclouds.elasticstack.compute.ElasticStackComputeServiceAdapter.listImages(ElasticStackComputeServiceAdapter.java:187)
at org.jclouds.compute.config.ComputeServiceAdapterContextModule$2.get(ComputeServiceAdapterContextModule.java:116)
at org.jclouds.compute.config.ComputeServiceAdapterContextModule$2.get(ComputeServiceAdapterContextModule.java:112)
at org.jclouds.collect.TransformingSetSupplier.get(TransformingSetSupplier.java:47)
at org.jclouds.collect.TransformingSetSupplier.get(TransformingSetSupplier.java:36)
at org.jclouds.compute.config.BaseComputeServiceContextModule$9.get(BaseComputeServiceContextModule.java:247)
at org.jclouds.compute.config.BaseComputeServiceContextModule$9.get(BaseComputeServiceContextModule.java:244)
at org.jclouds.rest.suppliers.SetAndThrowAuthorizationExceptionSupplier.get(SetAndThrowAuthorizationExceptionSupplier.java:49)
at org.jclouds.concurrent.RetryOnTimeOutExceptionSupplier.get(RetryOnTimeOutExceptionSupplier.java:47)
at org.jclouds.util.Suppliers2$ExpiringMemoizingSupplier.get(Suppliers2.java:130)
at org.jclouds.rest.suppliers.MemoizedRetryOnTimeOutButNotOnAuthorizationExceptionSupplier.get(MemoizedRetryOnTimeOutButNotOnAuthorizationExceptionSupplier.java:64)
at org.jclouds.compute.domain.internal.TemplateBuilderImpl.getImages(TemplateBuilderImpl.java:737)
at org.jclouds.compute.domain.internal.TemplateBuilderImpl.build(TemplateBuilderImpl.java:612)
at org.jclouds.compute.internal.BaseTemplateBuilderLiveTest.testTemplateBuilderCannotFind(BaseTemplateBuilderLiveTest.java:154)
at sun.reflect.NativeMethodAccessorImpl.invoke0(Native Method)
at sun.reflect.NativeMethodAccessorImpl.invoke(NativeMethodAccessorImpl.java:39)
at sun.reflect.DelegatingMethodAccessorImpl.invoke(DelegatingMethodAccessorImpl.java:25)
at java.lang.reflect.Method.invoke(Method.java:597)
at org.testng.internal.MethodInvocationHelper.invokeMethod(MethodInvocationHelper.java:80)
at org.testng.internal.Invoker.invokeMethod(Invoker.java:701)
... 15 more
testTemplateBuilderCannotFind(org.jclouds.go2cloud.compute.Go2CloudJohannesburg1TemplateBuilderLiveTest) Time elapsed: 0.962 sec <<< FAILURE!
org.testng.TestException:
Expected exception java.util.NoSuchElementException but got java.lang.ClassCastException: org.jclouds.elasticstack.domain.DriveInfo cannot be cast to java.lang.Comparable
at org.testng.internal.Invoker.handleInvocationResults(Invoker.java:1475)
at org.testng.internal.Invoker.invokeMethod(Invoker.java:750)
at org.testng.internal.Invoker.invokeTestMethod(Invoker.java:893)
at org.testng.internal.Invoker.invokeTestMethods(Invoker.java:1218)
at org.testng.internal.TestMethodWorker.invokeTestMethods(TestMethodWorker.java:127)
at org.testng.internal.TestMethodWorker.run(TestMethodWorker.java:111)
at org.testng.TestRunner.privateRun(TestRunner.java:758)
at org.testng.TestRunner.run(TestRunner.java:613)
at org.testng.SuiteRunner.runTest(SuiteRunner.java:334)
at org.testng.SuiteRunner.access$000(SuiteRunner.java:37)
at org.testng.SuiteRunner$SuiteWorker.run(SuiteRunner.java:368)
at org.testng.internal.thread.ThreadUtil$2.call(ThreadUtil.java:64)
at java.util.concurrent.FutureTask$Sync.innerRun(FutureTask.java:303)
at java.util.concurrent.FutureTask.run(FutureTask.java:138)
at java.util.concurrent.ThreadPoolExecutor$Worker.runTask(ThreadPoolExecutor.java:886)
at java.util.concurrent.ThreadPoolExecutor$Worker.run(ThreadPoolExecutor.java:908)
at java.lang.Thread.run(Thread.java:680)
Caused by: java.lang.ClassCastException: org.jclouds.elasticstack.domain.DriveInfo cannot be cast to java.lang.Comparable
at com.google.common.collect.NaturalOrdering.compare(NaturalOrdering.java:28)
at java.util.Arrays.mergeSort(Arrays.java:1270)
at java.util.Arrays.sort(Arrays.java:1210)
at com.google.common.collect.SortedIterables.sortedUnique(SortedIterables.java:95)
at com.google.common.collect.ImmutableSortedSet.copyOfInternal(ImmutableSortedSet.java:408)
at com.google.common.collect.ImmutableSortedSet.copyOf(ImmutableSortedSet.java:343)
at com.google.common.collect.ImmutableSortedSet.copyOf(ImmutableSortedSet.java:251)
at org.jclouds.util.Iterables2.concreteCopy(Iterables2.java:37)
at org.jclouds.elasticstack.compute.ElasticStackComputeServiceAdapter.listImages(ElasticStackComputeServiceAdapter.java:187)
at org.jclouds.compute.config.ComputeServiceAdapterContextModule$2.get(ComputeServiceAdapterContextModule.java:116)
at org.jclouds.compute.config.ComputeServiceAdapterContextModule$2.get(ComputeServiceAdapterContextModule.java:112)
at org.jclouds.collect.TransformingSetSupplier.get(TransformingSetSupplier.java:47)
at org.jclouds.collect.TransformingSetSupplier.get(TransformingSetSupplier.java:36)
at org.jclouds.compute.config.BaseComputeServiceContextModule$9.get(BaseComputeServiceContextModule.java:247)
at org.jclouds.compute.config.BaseComputeServiceContextModule$9.get(BaseComputeServiceContextModule.java:244)
at org.jclouds.rest.suppliers.SetAndThrowAuthorizationExceptionSupplier.get(SetAndThrowAuthorizationExceptionSupplier.java:49)
at org.jclouds.concurrent.RetryOnTimeOutExceptionSupplier.get(RetryOnTimeOutExceptionSupplier.java:47)
at org.jclouds.util.Suppliers2$ExpiringMemoizingSupplier.get(Suppliers2.java:130)
at org.jclouds.rest.suppliers.MemoizedRetryOnTimeOutButNotOnAuthorizationExceptionSupplier.get(MemoizedRetryOnTimeOutButNotOnAuthorizationExceptionSupplier.java:64)
at org.jclouds.compute.domain.internal.TemplateBuilderImpl.getImages(TemplateBuilderImpl.java:737)
at org.jclouds.compute.domain.internal.TemplateBuilderImpl.build(TemplateBuilderImpl.java:612)
at org.jclouds.compute.internal.BaseTemplateBuilderLiveTest.testTemplateBuilderCannotFind(BaseTemplateBuilderLiveTest.java:154)
at sun.reflect.NativeMethodAccessorImpl.invoke0(Native Method)
at sun.reflect.NativeMethodAccessorImpl.invoke(NativeMethodAccessorImpl.java:39)
at sun.reflect.DelegatingMethodAccessorImpl.invoke(DelegatingMethodAccessorImpl.java:25)
at java.lang.reflect.Method.invoke(Method.java:597)
at org.testng.internal.MethodInvocationHelper.invokeMethod(MethodInvocationHelper.java:80)
at org.testng.internal.Invoker.invokeMethod(Invoker.java:701)
... 15 more
Caused by: java.lang.ClassCastException: org.jclouds.elasticstack.domain.DriveInfo cannot be cast to java.lang.Comparable
at com.google.common.collect.NaturalOrdering.compare(NaturalOrdering.java:28)
at java.util.Arrays.mergeSort(Arrays.java:1270)
at java.util.Arrays.sort(Arrays.java:1210)
at com.google.common.collect.SortedIterables.sortedUnique(SortedIterables.java:95)
at com.google.common.collect.ImmutableSortedSet.copyOfInternal(ImmutableSortedSet.java:408)
at com.google.common.collect.ImmutableSortedSet.copyOf(ImmutableSortedSet.java:343)
at com.google.common.collect.ImmutableSortedSet.copyOf(ImmutableSortedSet.java:251)
at org.jclouds.util.Iterables2.concreteCopy(Iterables2.java:37)
at org.jclouds.elasticstack.compute.ElasticStackComputeServiceAdapter.listImages(ElasticStackComputeServiceAdapter.java:187)
at org.jclouds.compute.config.ComputeServiceAdapterContextModule$2.get(ComputeServiceAdapterContextModule.java:116)
at org.jclouds.compute.config.ComputeServiceAdapterContextModule$2.get(ComputeServiceAdapterContextModule.java:112)
at org.jclouds.collect.TransformingSetSupplier.get(TransformingSetSupplier.java:47)
at org.jclouds.collect.TransformingSetSupplier.get(TransformingSetSupplier.java:36)
at org.jclouds.compute.config.BaseComputeServiceContextModule$9.get(BaseComputeServiceContextModule.java:247)
at org.jclouds.compute.config.BaseComputeServiceContextModule$9.get(BaseComputeServiceContextModule.java:244)
at org.jclouds.rest.suppliers.SetAndThrowAuthorizationExceptionSupplier.get(SetAndThrowAuthorizationExceptionSupplier.java:49)
at org.jclouds.concurrent.RetryOnTimeOutExceptionSupplier.get(RetryOnTimeOutExceptionSupplier.java:47)
at org.jclouds.util.Suppliers2$ExpiringMemoizingSupplier.get(Suppliers2.java:130)
at org.jclouds.rest.suppliers.MemoizedRetryOnTimeOutButNotOnAuthorizationExceptionSupplier.get(MemoizedRetryOnTimeOutButNotOnAuthorizationExceptionSupplier.java:64)
at org.jclouds.compute.domain.internal.TemplateBuilderImpl.getImages(TemplateBuilderImpl.java:737)
at org.jclouds.compute.domain.internal.TemplateBuilderImpl.build(TemplateBuilderImpl.java:612)
at org.jclouds.compute.internal.BaseTemplateBuilderLiveTest.testTemplateBuilderCannotFind(BaseTemplateBuilderLiveTest.java:154)
at sun.reflect.NativeMethodAccessorImpl.invoke0(Native Method)
at sun.reflect.NativeMethodAccessorImpl.invoke(NativeMethodAccessorImpl.java:39)
at sun.reflect.DelegatingMethodAccessorImpl.invoke(DelegatingMethodAccessorImpl.java:25)
at java.lang.reflect.Method.invoke(Method.java:597)
at org.testng.internal.MethodInvocationHelper.invokeMethod(MethodInvocationHelper.java:80)
at org.testng.internal.Invoker.invokeMethod(Invoker.java:701)
... 15 more
testTemplateBuilderCannotFind(org.jclouds.go2cloud.compute.Go2CloudJohannesburg1TemplateBuilderLiveTest) Time elapsed: 0.883 sec <<< FAILURE!
org.testng.TestException:
Expected exception java.util.NoSuchElementException but got java.lang.ClassCastException: org.jclouds.elasticstack.domain.DriveInfo cannot be cast to java.lang.Comparable
at org.testng.internal.Invoker.handleInvocationResults(Invoker.java:1475)
at org.testng.internal.Invoker.invokeMethod(Invoker.java:750)
at org.testng.internal.Invoker.invokeTestMethod(Invoker.java:893)
at org.testng.internal.Invoker.invokeTestMethods(Invoker.java:1218)
at org.testng.internal.TestMethodWorker.invokeTestMethods(TestMethodWorker.java:127)
at org.testng.internal.TestMethodWorker.run(TestMethodWorker.java:111)
at org.testng.TestRunner.privateRun(TestRunner.java:758)
at org.testng.TestRunner.run(TestRunner.java:613)
at org.testng.SuiteRunner.runTest(SuiteRunner.java:334)
at org.testng.SuiteRunner.access$000(SuiteRunner.java:37)
at org.testng.SuiteRunner$SuiteWorker.run(SuiteRunner.java:368)
at org.testng.internal.thread.ThreadUtil$2.call(ThreadUtil.java:64)
at java.util.concurrent.FutureTask$Sync.innerRun(FutureTask.java:303)
at java.util.concurrent.FutureTask.run(FutureTask.java:138)
at java.util.concurrent.ThreadPoolExecutor$Worker.runTask(ThreadPoolExecutor.java:886)
at java.util.concurrent.ThreadPoolExecutor$Worker.run(ThreadPoolExecutor.java:908)
at java.lang.Thread.run(Thread.java:680)
Caused by: java.lang.ClassCastException: org.jclouds.elasticstack.domain.DriveInfo cannot be cast to java.lang.Comparable
at com.google.common.collect.NaturalOrdering.compare(NaturalOrdering.java:28)
at java.util.Arrays.mergeSort(Arrays.java:1270)
at java.util.Arrays.sort(Arrays.java:1210)
at com.google.common.collect.SortedIterables.sortedUnique(SortedIterables.java:95)
at com.google.common.collect.ImmutableSortedSet.copyOfInternal(ImmutableSortedSet.java:408)
at com.google.common.collect.ImmutableSortedSet.copyOf(ImmutableSortedSet.java:343)
at com.google.common.collect.ImmutableSortedSet.copyOf(ImmutableSortedSet.java:251)
at org.jclouds.util.Iterables2.concreteCopy(Iterables2.java:37)
at org.jclouds.elasticstack.compute.ElasticStackComputeServiceAdapter.listImages(ElasticStackComputeServiceAdapter.java:187)
at org.jclouds.compute.config.ComputeServiceAdapterContextModule$2.get(ComputeServiceAdapterContextModule.java:116)
at org.jclouds.compute.config.ComputeServiceAdapterContextModule$2.get(ComputeServiceAdapterContextModule.java:112)
at org.jclouds.collect.TransformingSetSupplier.get(TransformingSetSupplier.java:47)
at org.jclouds.collect.TransformingSetSupplier.get(TransformingSetSupplier.java:36)
at org.jclouds.compute.config.BaseComputeServiceContextModule$9.get(BaseComputeServiceContextModule.java:247)
at org.jclouds.compute.config.BaseComputeServiceContextModule$9.get(BaseComputeServiceContextModule.java:244)
at org.jclouds.rest.suppliers.SetAndThrowAuthorizationExceptionSupplier.get(SetAndThrowAuthorizationExceptionSupplier.java:49)
at org.jclouds.concurrent.RetryOnTimeOutExceptionSupplier.get(RetryOnTimeOutExceptionSupplier.java:47)
at org.jclouds.util.Suppliers2$ExpiringMemoizingSupplier.get(Suppliers2.java:130)
at org.jclouds.rest.suppliers.MemoizedRetryOnTimeOutButNotOnAuthorizationExceptionSupplier.get(MemoizedRetryOnTimeOutButNotOnAuthorizationExceptionSupplier.java:64)
at org.jclouds.compute.domain.internal.TemplateBuilderImpl.getImages(TemplateBuilderImpl.java:737)
at org.jclouds.compute.domain.internal.TemplateBuilderImpl.build(TemplateBuilderImpl.java:612)
at org.jclouds.compute.internal.BaseTemplateBuilderLiveTest.testTemplateBuilderCannotFind(BaseTemplateBuilderLiveTest.java:154)
at sun.reflect.NativeMethodAccessorImpl.invoke0(Native Method)
at sun.reflect.NativeMethodAccessorImpl.invoke(NativeMethodAccessorImpl.java:39)
at sun.reflect.DelegatingMethodAccessorImpl.invoke(DelegatingMethodAccessorImpl.java:25)
at java.lang.reflect.Method.invoke(Method.java:597)
at org.testng.internal.MethodInvocationHelper.invokeMethod(MethodInvocationHelper.java:80)
at org.testng.internal.Invoker.invokeMethod(Invoker.java:701)
... 15 more
Caused by: java.lang.ClassCastException: org.jclouds.elasticstack.domain.DriveInfo cannot be cast to java.lang.Comparable
at com.google.common.collect.NaturalOrdering.compare(NaturalOrdering.java:28)
at java.util.Arrays.mergeSort(Arrays.java:1270)
at java.util.Arrays.sort(Arrays.java:1210)
at com.google.common.collect.SortedIterables.sortedUnique(SortedIterables.java:95)
at com.google.common.collect.ImmutableSortedSet.copyOfInternal(ImmutableSortedSet.java:408)
at com.google.common.collect.ImmutableSortedSet.copyOf(ImmutableSortedSet.java:343)
at com.google.common.collect.ImmutableSortedSet.copyOf(ImmutableSortedSet.java:251)
at org.jclouds.util.Iterables2.concreteCopy(Iterables2.java:37)
at org.jclouds.elasticstack.compute.ElasticStackComputeServiceAdapter.listImages(ElasticStackComputeServiceAdapter.java:187)
at org.jclouds.compute.config.ComputeServiceAdapterContextModule$2.get(ComputeServiceAdapterContextModule.java:116)
at org.jclouds.compute.config.ComputeServiceAdapterContextModule$2.get(ComputeServiceAdapterContextModule.java:112)
at org.jclouds.collect.TransformingSetSupplier.get(TransformingSetSupplier.java:47)
at org.jclouds.collect.TransformingSetSupplier.get(TransformingSetSupplier.java:36)
at org.jclouds.compute.config.BaseComputeServiceContextModule$9.get(BaseComputeServiceContextModule.java:247)
at org.jclouds.compute.config.BaseComputeServiceContextModule$9.get(BaseComputeServiceContextModule.java:244)
at org.jclouds.rest.suppliers.SetAndThrowAuthorizationExceptionSupplier.get(SetAndThrowAuthorizationExceptionSupplier.java:49)
at org.jclouds.concurrent.RetryOnTimeOutExceptionSupplier.get(RetryOnTimeOutExceptionSupplier.java:47)
at org.jclouds.util.Suppliers2$ExpiringMemoizingSupplier.get(Suppliers2.java:130)
at org.jclouds.rest.suppliers.MemoizedRetryOnTimeOutButNotOnAuthorizationExceptionSupplier.get(MemoizedRetryOnTimeOutButNotOnAuthorizationExceptionSupplier.java:64)
at org.jclouds.compute.domain.internal.TemplateBuilderImpl.getImages(TemplateBuilderImpl.java:737)
at org.jclouds.compute.domain.internal.TemplateBuilderImpl.build(TemplateBuilderImpl.java:612)
at org.jclouds.compute.internal.BaseTemplateBuilderLiveTest.testTemplateBuilderCannotFind(BaseTemplateBuilderLiveTest.java:154)
at sun.reflect.NativeMethodAccessorImpl.invoke0(Native Method)
at sun.reflect.NativeMethodAccessorImpl.invoke(NativeMethodAccessorImpl.java:39)
at sun.reflect.DelegatingMethodAccessorImpl.invoke(DelegatingMethodAccessorImpl.java:25)
at java.lang.reflect.Method.invoke(Method.java:597)
at org.testng.internal.MethodInvocationHelper.invokeMethod(MethodInvocationHelper.java:80)
at org.testng.internal.Invoker.invokeMethod(Invoker.java:701)
... 15 more
testTemplateBuilderCannotFind(org.jclouds.go2cloud.compute.Go2CloudJohannesburg1TemplateBuilderLiveTest) Time elapsed: 1.064 sec <<< FAILURE!
org.testng.TestException:
Expected exception java.util.NoSuchElementException but got java.lang.ClassCastException: org.jclouds.elasticstack.domain.DriveInfo cannot be cast to java.lang.Comparable
at org.testng.internal.Invoker.handleInvocationResults(Invoker.java:1475)
at org.testng.internal.Invoker.invokeMethod(Invoker.java:750)
at org.testng.internal.Invoker.invokeTestMethod(Invoker.java:893)
at org.testng.internal.Invoker.invokeTestMethods(Invoker.java:1218)
at org.testng.internal.TestMethodWorker.invokeTestMethods(TestMethodWorker.java:127)
at org.testng.internal.TestMethodWorker.run(TestMethodWorker.java:111)
at org.testng.TestRunner.privateRun(TestRunner.java:758)
at org.testng.TestRunner.run(TestRunner.java:613)
at org.testng.SuiteRunner.runTest(SuiteRunner.java:334)
at org.testng.SuiteRunner.access$000(SuiteRunner.java:37)
at org.testng.SuiteRunner$SuiteWorker.run(SuiteRunner.java:368)
at org.testng.internal.thread.ThreadUtil$2.call(ThreadUtil.java:64)
at java.util.concurrent.FutureTask$Sync.innerRun(FutureTask.java:303)
at java.util.concurrent.FutureTask.run(FutureTask.java:138)
at java.util.concurrent.ThreadPoolExecutor$Worker.runTask(ThreadPoolExecutor.java:886)
at java.util.concurrent.ThreadPoolExecutor$Worker.run(ThreadPoolExecutor.java:908)
at java.lang.Thread.run(Thread.java:680)
Caused by: java.lang.ClassCastException: org.jclouds.elasticstack.domain.DriveInfo cannot be cast to java.lang.Comparable
at com.google.common.collect.NaturalOrdering.compare(NaturalOrdering.java:28)
at java.util.Arrays.mergeSort(Arrays.java:1270)
at java.util.Arrays.sort(Arrays.java:1210)
at com.google.common.collect.SortedIterables.sortedUnique(SortedIterables.java:95)
at com.google.common.collect.ImmutableSortedSet.copyOfInternal(ImmutableSortedSet.java:408)
at com.google.common.collect.ImmutableSortedSet.copyOf(ImmutableSortedSet.java:343)
at com.google.common.collect.ImmutableSortedSet.copyOf(ImmutableSortedSet.java:251)
at org.jclouds.util.Iterables2.concreteCopy(Iterables2.java:37)
at org.jclouds.elasticstack.compute.ElasticStackComputeServiceAdapter.listImages(ElasticStackComputeServiceAdapter.java:187)
at org.jclouds.compute.config.ComputeServiceAdapterContextModule$2.get(ComputeServiceAdapterContextModule.java:116)
at org.jclouds.compute.config.ComputeServiceAdapterContextModule$2.get(ComputeServiceAdapterContextModule.java:112)
at org.jclouds.collect.TransformingSetSupplier.get(TransformingSetSupplier.java:47)
at org.jclouds.collect.TransformingSetSupplier.get(TransformingSetSupplier.java:36)
at org.jclouds.compute.config.BaseComputeServiceContextModule$9.get(BaseComputeServiceContextModule.java:247)
at org.jclouds.compute.config.BaseComputeServiceContextModule$9.get(BaseComputeServiceContextModule.java:244)
at org.jclouds.rest.suppliers.SetAndThrowAuthorizationExceptionSupplier.get(SetAndThrowAuthorizationExceptionSupplier.java:49)
at org.jclouds.concurrent.RetryOnTimeOutExceptionSupplier.get(RetryOnTimeOutExceptionSupplier.java:47)
at org.jclouds.util.Suppliers2$ExpiringMemoizingSupplier.get(Suppliers2.java:130)
at org.jclouds.rest.suppliers.MemoizedRetryOnTimeOutButNotOnAuthorizationExceptionSupplier.get(MemoizedRetryOnTimeOutButNotOnAuthorizationExceptionSupplier.java:64)
at org.jclouds.compute.domain.internal.TemplateBuilderImpl.getImages(TemplateBuilderImpl.java:737)
at org.jclouds.compute.domain.internal.TemplateBuilderImpl.build(TemplateBuilderImpl.java:612)
at org.jclouds.compute.internal.BaseTemplateBuilderLiveTest.testTemplateBuilderCannotFind(BaseTemplateBuilderLiveTest.java:154)
at sun.reflect.NativeMethodAccessorImpl.invoke0(Native Method)
at sun.reflect.NativeMethodAccessorImpl.invoke(NativeMethodAccessorImpl.java:39)
at sun.reflect.DelegatingMethodAccessorImpl.invoke(DelegatingMethodAccessorImpl.java:25)
at java.lang.reflect.Method.invoke(Method.java:597)
at org.testng.internal.MethodInvocationHelper.invokeMethod(MethodInvocationHelper.java:80)
at org.testng.internal.Invoker.invokeMethod(Invoker.java:701)
... 15 more
Caused by: java.lang.ClassCastException: org.jclouds.elasticstack.domain.DriveInfo cannot be cast to java.lang.Comparable
at com.google.common.collect.NaturalOrdering.compare(NaturalOrdering.java:28)
at java.util.Arrays.mergeSort(Arrays.java:1270)
at java.util.Arrays.sort(Arrays.java:1210)
at com.google.common.collect.SortedIterables.sortedUnique(SortedIterables.java:95)
at com.google.common.collect.ImmutableSortedSet.copyOfInternal(ImmutableSortedSet.java:408)
at com.google.common.collect.ImmutableSortedSet.copyOf(ImmutableSortedSet.java:343)
at com.google.common.collect.ImmutableSortedSet.copyOf(ImmutableSortedSet.java:251)
at org.jclouds.util.Iterables2.concreteCopy(Iterables2.java:37)
at org.jclouds.elasticstack.compute.ElasticStackComputeServiceAdapter.listImages(ElasticStackComputeServiceAdapter.java:187)
at org.jclouds.compute.config.ComputeServiceAdapterContextModule$2.get(ComputeServiceAdapterContextModule.java:116)
at org.jclouds.compute.config.ComputeServiceAdapterContextModule$2.get(ComputeServiceAdapterContextModule.java:112)
at org.jclouds.collect.TransformingSetSupplier.get(TransformingSetSupplier.java:47)
at org.jclouds.collect.TransformingSetSupplier.get(TransformingSetSupplier.java:36)
at org.jclouds.compute.config.BaseComputeServiceContextModule$9.get(BaseComputeServiceContextModule.java:247)
at org.jclouds.compute.config.BaseComputeServiceContextModule$9.get(BaseComputeServiceContextModule.java:244)
at org.jclouds.rest.suppliers.SetAndThrowAuthorizationExceptionSupplier.get(SetAndThrowAuthorizationExceptionSupplier.java:49)
at org.jclouds.concurrent.RetryOnTimeOutExceptionSupplier.get(RetryOnTimeOutExceptionSupplier.java:47)
at org.jclouds.util.Suppliers2$ExpiringMemoizingSupplier.get(Suppliers2.java:130)
at org.jclouds.rest.suppliers.MemoizedRetryOnTimeOutButNotOnAuthorizationExceptionSupplier.get(MemoizedRetryOnTimeOutButNotOnAuthorizationExceptionSupplier.java:64)
at org.jclouds.compute.domain.internal.TemplateBuilderImpl.getImages(TemplateBuilderImpl.java:737)
at org.jclouds.compute.domain.internal.TemplateBuilderImpl.build(TemplateBuilderImpl.java:612)
at org.jclouds.compute.internal.BaseTemplateBuilderLiveTest.testTemplateBuilderCannotFind(BaseTemplateBuilderLiveTest.java:154)
at sun.reflect.NativeMethodAccessorImpl.invoke0(Native Method)
at sun.reflect.NativeMethodAccessorImpl.invoke(NativeMethodAccessorImpl.java:39)
at sun.reflect.DelegatingMethodAccessorImpl.invoke(DelegatingMethodAccessorImpl.java:25)
at java.lang.reflect.Method.invoke(Method.java:597)
at org.testng.internal.MethodInvocationHelper.invokeMethod(MethodInvocationHelper.java:80)
at org.testng.internal.Invoker.invokeMethod(Invoker.java:701)
... 15 more
testTemplateBuilderCannotFind(org.jclouds.go2cloud.compute.Go2CloudJohannesburg1TemplateBuilderLiveTest) Time elapsed: 1.089 sec <<< FAILURE!
org.testng.TestException:
Expected exception java.util.NoSuchElementException but got java.lang.ClassCastException: org.jclouds.elasticstack.domain.DriveInfo cannot be cast to java.lang.Comparable
at org.testng.internal.Invoker.handleInvocationResults(Invoker.java:1475)
at org.testng.internal.Invoker.invokeMethod(Invoker.java:750)
at org.testng.internal.Invoker.invokeTestMethod(Invoker.java:893)
at org.testng.internal.Invoker.invokeTestMethods(Invoker.java:1218)
at org.testng.internal.TestMethodWorker.invokeTestMethods(TestMethodWorker.java:127)
at org.testng.internal.TestMethodWorker.run(TestMethodWorker.java:111)
at org.testng.TestRunner.privateRun(TestRunner.java:758)
at org.testng.TestRunner.run(TestRunner.java:613)
at org.testng.SuiteRunner.runTest(SuiteRunner.java:334)
at org.testng.SuiteRunner.access$000(SuiteRunner.java:37)
at org.testng.SuiteRunner$SuiteWorker.run(SuiteRunner.java:368)
at org.testng.internal.thread.ThreadUtil$2.call(ThreadUtil.java:64)
at java.util.concurrent.FutureTask$Sync.innerRun(FutureTask.java:303)
at java.util.concurrent.FutureTask.run(FutureTask.java:138)
at java.util.concurrent.ThreadPoolExecutor$Worker.runTask(ThreadPoolExecutor.java:886)
at java.util.concurrent.ThreadPoolExecutor$Worker.run(ThreadPoolExecutor.java:908)
at java.lang.Thread.run(Thread.java:680)
Caused by: java.lang.ClassCastException: org.jclouds.elasticstack.domain.DriveInfo cannot be cast to java.lang.Comparable
at com.google.common.collect.NaturalOrdering.compare(NaturalOrdering.java:28)
at java.util.Arrays.mergeSort(Arrays.java:1270)
at java.util.Arrays.sort(Arrays.java:1210)
at com.google.common.collect.SortedIterables.sortedUnique(SortedIterables.java:95)
at com.google.common.collect.ImmutableSortedSet.copyOfInternal(ImmutableSortedSet.java:408)
at com.google.common.collect.ImmutableSortedSet.copyOf(ImmutableSortedSet.java:343)
at com.google.common.collect.ImmutableSortedSet.copyOf(ImmutableSortedSet.java:251)
at org.jclouds.util.Iterables2.concreteCopy(Iterables2.java:37)
at org.jclouds.elasticstack.compute.ElasticStackComputeServiceAdapter.listImages(ElasticStackComputeServiceAdapter.java:187)
at org.jclouds.compute.config.ComputeServiceAdapterContextModule$2.get(ComputeServiceAdapterContextModule.java:116)
at org.jclouds.compute.config.ComputeServiceAdapterContextModule$2.get(ComputeServiceAdapterContextModule.java:112)
at org.jclouds.collect.TransformingSetSupplier.get(TransformingSetSupplier.java:47)
at org.jclouds.collect.TransformingSetSupplier.get(TransformingSetSupplier.java:36)
at org.jclouds.compute.config.BaseComputeServiceContextModule$9.get(BaseComputeServiceContextModule.java:247)
at org.jclouds.compute.config.BaseComputeServiceContextModule$9.get(BaseComputeServiceContextModule.java:244)
at org.jclouds.rest.suppliers.SetAndThrowAuthorizationExceptionSupplier.get(SetAndThrowAuthorizationExceptionSupplier.java:49)
at org.jclouds.concurrent.RetryOnTimeOutExceptionSupplier.get(RetryOnTimeOutExceptionSupplier.java:47)
at org.jclouds.util.Suppliers2$ExpiringMemoizingSupplier.get(Suppliers2.java:130)
at org.jclouds.rest.suppliers.MemoizedRetryOnTimeOutButNotOnAuthorizationExceptionSupplier.get(MemoizedRetryOnTimeOutButNotOnAuthorizationExceptionSupplier.java:64)
at org.jclouds.compute.domain.internal.TemplateBuilderImpl.getImages(TemplateBuilderImpl.java:737)
at org.jclouds.compute.domain.internal.TemplateBuilderImpl.build(TemplateBuilderImpl.java:612)
at org.jclouds.compute.internal.BaseTemplateBuilderLiveTest.testTemplateBuilderCannotFind(BaseTemplateBuilderLiveTest.java:154)
at sun.reflect.NativeMethodAccessorImpl.invoke0(Native Method)
at sun.reflect.NativeMethodAccessorImpl.invoke(NativeMethodAccessorImpl.java:39)
at sun.reflect.DelegatingMethodAccessorImpl.invoke(DelegatingMethodAccessorImpl.java:25)
at java.lang.reflect.Method.invoke(Method.java:597)
at org.testng.internal.MethodInvocationHelper.invokeMethod(MethodInvocationHelper.java:80)
at org.testng.internal.Invoker.invokeMethod(Invoker.java:701)
... 15 more
Caused by: java.lang.ClassCastException: org.jclouds.elasticstack.domain.DriveInfo cannot be cast to java.lang.Comparable
at com.google.common.collect.NaturalOrdering.compare(NaturalOrdering.java:28)
at java.util.Arrays.mergeSort(Arrays.java:1270)
at java.util.Arrays.sort(Arrays.java:1210)
at com.google.common.collect.SortedIterables.sortedUnique(SortedIterables.java:95)
at com.google.common.collect.ImmutableSortedSet.copyOfInternal(ImmutableSortedSet.java:408)
at com.google.common.collect.ImmutableSortedSet.copyOf(ImmutableSortedSet.java:343)
at com.google.common.collect.ImmutableSortedSet.copyOf(ImmutableSortedSet.java:251)
at org.jclouds.util.Iterables2.concreteCopy(Iterables2.java:37)
at org.jclouds.elasticstack.compute.ElasticStackComputeServiceAdapter.listImages(ElasticStackComputeServiceAdapter.java:187)
at org.jclouds.compute.config.ComputeServiceAdapterContextModule$2.get(ComputeServiceAdapterContextModule.java:116)
at org.jclouds.compute.config.ComputeServiceAdapterContextModule$2.get(ComputeServiceAdapterContextModule.java:112)
at org.jclouds.collect.TransformingSetSupplier.get(TransformingSetSupplier.java:47)
at org.jclouds.collect.TransformingSetSupplier.get(TransformingSetSupplier.java:36)
at org.jclouds.compute.config.BaseComputeServiceContextModule$9.get(BaseComputeServiceContextModule.java:247)
at org.jclouds.compute.config.BaseComputeServiceContextModule$9.get(BaseComputeServiceContextModule.java:244)
at org.jclouds.rest.suppliers.SetAndThrowAuthorizationExceptionSupplier.get(SetAndThrowAuthorizationExceptionSupplier.java:49)
at org.jclouds.concurrent.RetryOnTimeOutExceptionSupplier.get(RetryOnTimeOutExceptionSupplier.java:47)
at org.jclouds.util.Suppliers2$ExpiringMemoizingSupplier.get(Suppliers2.java:130)
at org.jclouds.rest.suppliers.MemoizedRetryOnTimeOutButNotOnAuthorizationExceptionSupplier.get(MemoizedRetryOnTimeOutButNotOnAuthorizationExceptionSupplier.java:64)
at org.jclouds.compute.domain.internal.TemplateBuilderImpl.getImages(TemplateBuilderImpl.java:737)
at org.jclouds.compute.domain.internal.TemplateBuilderImpl.build(TemplateBuilderImpl.java:612)
at org.jclouds.compute.internal.BaseTemplateBuilderLiveTest.testTemplateBuilderCannotFind(BaseTemplateBuilderLiveTest.java:154)
at sun.reflect.NativeMethodAccessorImpl.invoke0(Native Method)
at sun.reflect.NativeMethodAccessorImpl.invoke(NativeMethodAccessorImpl.java:39)
at sun.reflect.DelegatingMethodAccessorImpl.invoke(DelegatingMethodAccessorImpl.java:25)
at java.lang.reflect.Method.invoke(Method.java:597)
at org.testng.internal.MethodInvocationHelper.invokeMethod(MethodInvocationHelper.java:80)
at org.testng.internal.Invoker.invokeMethod(Invoker.java:701)
... 15 more
testCreateAndRunAService(org.jclouds.go2cloud.compute.Go2CloudJohannesburg1ComputeServiceLiveTest) Time elapsed: 0.147 sec <<< FAILURE!
java.lang.ClassCastException: org.jclouds.elasticstack.domain.DriveInfo cannot be cast to java.lang.Comparable
at com.google.common.collect.NaturalOrdering.compare(NaturalOrdering.java:28)
at java.util.Arrays.mergeSort(Arrays.java:1270)
at java.util.Arrays.sort(Arrays.java:1210)
at com.google.common.collect.SortedIterables.sortedUnique(SortedIterables.java:95)
at com.google.common.collect.ImmutableSortedSet.copyOfInternal(ImmutableSortedSet.java:408)
at com.google.common.collect.ImmutableSortedSet.copyOf(ImmutableSortedSet.java:343)
at com.google.common.collect.ImmutableSortedSet.copyOf(ImmutableSortedSet.java:251)
at org.jclouds.util.Iterables2.concreteCopy(Iterables2.java:37)
at org.jclouds.elasticstack.compute.ElasticStackComputeServiceAdapter.listImages(ElasticStackComputeServiceAdapter.java:187)
at org.jclouds.compute.config.ComputeServiceAdapterContextModule$2.get(ComputeServiceAdapterContextModule.java:116)
at org.jclouds.compute.config.ComputeServiceAdapterContextModule$2.get(ComputeServiceAdapterContextModule.java:112)
at org.jclouds.collect.TransformingSetSupplier.get(TransformingSetSupplier.java:47)
at org.jclouds.collect.TransformingSetSupplier.get(TransformingSetSupplier.java:36)
at org.jclouds.compute.config.BaseComputeServiceContextModule$9.get(BaseComputeServiceContextModule.java:247)
at org.jclouds.compute.config.BaseComputeServiceContextModule$9.get(BaseComputeServiceContextModule.java:244)
at org.jclouds.rest.suppliers.SetAndThrowAuthorizationExceptionSupplier.get(SetAndThrowAuthorizationExceptionSupplier.java:49)
at org.jclouds.concurrent.RetryOnTimeOutExceptionSupplier.get(RetryOnTimeOutExceptionSupplier.java:47)
at org.jclouds.util.Suppliers2$ExpiringMemoizingSupplier.get(Suppliers2.java:130)
at org.jclouds.rest.suppliers.MemoizedRetryOnTimeOutButNotOnAuthorizationExceptionSupplier.get(MemoizedRetryOnTimeOutButNotOnAuthorizationExceptionSupplier.java:64)
at org.jclouds.collect.FindResourceInSet.apply(FindResourceInSet.java:56)
at org.jclouds.elasticstack.compute.functions.ServerInfoToNodeMetadata.apply(ServerInfoToNodeMetadata.java:101)
at org.jclouds.elasticstack.compute.functions.ServerInfoToNodeMetadata.apply(ServerInfoToNodeMetadata.java:62)
at com.google.common.base.Functions$FunctionComposition.apply(Functions.java:209)
at com.google.common.collect.Iterators$9.transform(Iterators.java:845)
at com.google.common.collect.TransformedIterator.next(TransformedIterator.java:48)
at com.google.common.collect.Iterators$8.computeNext(Iterators.java:687)
at com.google.common.collect.AbstractIterator.tryToComputeNext(AbstractIterator.java:143)
at com.google.common.collect.AbstractIterator.hasNext(AbstractIterator.java:138)
at com.google.common.collect.Sets.newLinkedHashSet(Sets.java:290)
at org.jclouds.compute.internal.BaseComputeService.detailsOnAllNodes(BaseComputeService.java:624)
at org.jclouds.compute.internal.BaseComputeService.nodesMatchingFilterAndNotTerminated(BaseComputeService.java:313)
at org.jclouds.compute.internal.BaseComputeService.destroyNodesMatching(BaseComputeService.java:245)
at org.jclouds.compute.internal.BaseComputeServiceLiveTest.testCreateAndRunAService(BaseComputeServiceLiveTest.java:684)
at sun.reflect.NativeMethodAccessorImpl.invoke0(Native Method)
at sun.reflect.NativeMethodAccessorImpl.invoke(NativeMethodAccessorImpl.java:39)
at sun.reflect.DelegatingMethodAccessorImpl.invoke(DelegatingMethodAccessorImpl.java:25)
at java.lang.reflect.Method.invoke(Method.java:597)
at org.testng.internal.MethodInvocationHelper.invokeMethod(MethodInvocationHelper.java:80)
at org.testng.internal.Invoker.invokeMethod(Invoker.java:701)
at org.testng.internal.Invoker.invokeTestMethod(Invoker.java:893)
at org.testng.internal.Invoker.invokeTestMethods(Invoker.java:1218)
at org.testng.internal.TestMethodWorker.invokeTestMethods(TestMethodWorker.java:127)
at org.testng.internal.TestMethodWorker.run(TestMethodWorker.java:111)
at org.testng.TestRunner.privateRun(TestRunner.java:758)
at org.testng.TestRunner.run(TestRunner.java:613)
at org.testng.SuiteRunner.runTest(SuiteRunner.java:334)
at org.testng.SuiteRunner.access$000(SuiteRunner.java:37)
at org.testng.SuiteRunner$SuiteWorker.run(SuiteRunner.java:368)
at org.testng.internal.thread.ThreadUtil$2.call(ThreadUtil.java:64)
at java.util.concurrent.FutureTask$Sync.innerRun(FutureTask.java:303)
at java.util.concurrent.FutureTask.run(FutureTask.java:138)
at java.util.concurrent.ThreadPoolExecutor$Worker.runTask(ThreadPoolExecutor.java:886)
at java.util.concurrent.ThreadPoolExecutor$Worker.run(ThreadPoolExecutor.java:908)
at java.lang.Thread.run(Thread.java:680)
testTemplateBuilderCannotFind(org.jclouds.go2cloud.compute.Go2CloudJohannesburg1TemplateBuilderLiveTest) Time elapsed: 1.174 sec <<< FAILURE!
org.testng.TestException:
Expected exception java.util.NoSuchElementException but got java.lang.ClassCastException: org.jclouds.elasticstack.domain.DriveInfo cannot be cast to java.lang.Comparable
at org.testng.internal.Invoker.handleInvocationResults(Invoker.java:1475)
at org.testng.internal.Invoker.invokeMethod(Invoker.java:750)
at org.testng.internal.Invoker.invokeTestMethod(Invoker.java:893)
at org.testng.internal.Invoker.invokeTestMethods(Invoker.java:1218)
at org.testng.internal.TestMethodWorker.invokeTestMethods(TestMethodWorker.java:127)
at org.testng.internal.TestMethodWorker.run(TestMethodWorker.java:111)
at org.testng.TestRunner.privateRun(TestRunner.java:758)
at org.testng.TestRunner.run(TestRunner.java:613)
at org.testng.SuiteRunner.runTest(SuiteRunner.java:334)
at org.testng.SuiteRunner.access$000(SuiteRunner.java:37)
at org.testng.SuiteRunner$SuiteWorker.run(SuiteRunner.java:368)
at org.testng.internal.thread.ThreadUtil$2.call(ThreadUtil.java:64)
at java.util.concurrent.FutureTask$Sync.innerRun(FutureTask.java:303)
at java.util.concurrent.FutureTask.run(FutureTask.java:138)
at java.util.concurrent.ThreadPoolExecutor$Worker.runTask(ThreadPoolExecutor.java:886)
at java.util.concurrent.ThreadPoolExecutor$Worker.run(ThreadPoolExecutor.java:908)
at java.lang.Thread.run(Thread.java:680)
Caused by: java.lang.ClassCastException: org.jclouds.elasticstack.domain.DriveInfo cannot be cast to java.lang.Comparable
at com.google.common.collect.NaturalOrdering.compare(NaturalOrdering.java:28)
at java.util.Arrays.mergeSort(Arrays.java:1270)
at java.util.Arrays.sort(Arrays.java:1210)
at com.google.common.collect.SortedIterables.sortedUnique(SortedIterables.java:95)
at com.google.common.collect.ImmutableSortedSet.copyOfInternal(ImmutableSortedSet.java:408)
at com.google.common.collect.ImmutableSortedSet.copyOf(ImmutableSortedSet.java:343)
at com.google.common.collect.ImmutableSortedSet.copyOf(ImmutableSortedSet.java:251)
at org.jclouds.util.Iterables2.concreteCopy(Iterables2.java:37)
at org.jclouds.elasticstack.compute.ElasticStackComputeServiceAdapter.listImages(ElasticStackComputeServiceAdapter.java:187)
at org.jclouds.compute.config.ComputeServiceAdapterContextModule$2.get(ComputeServiceAdapterContextModule.java:116)
at org.jclouds.compute.config.ComputeServiceAdapterContextModule$2.get(ComputeServiceAdapterContextModule.java:112)
at org.jclouds.collect.TransformingSetSupplier.get(TransformingSetSupplier.java:47)
at org.jclouds.collect.TransformingSetSupplier.get(TransformingSetSupplier.java:36)
at org.jclouds.compute.config.BaseComputeServiceContextModule$9.get(BaseComputeServiceContextModule.java:247)
at org.jclouds.compute.config.BaseComputeServiceContextModule$9.get(BaseComputeServiceContextModule.java:244)
at org.jclouds.rest.suppliers.SetAndThrowAuthorizationExceptionSupplier.get(SetAndThrowAuthorizationExceptionSupplier.java:49)
at org.jclouds.concurrent.RetryOnTimeOutExceptionSupplier.get(RetryOnTimeOutExceptionSupplier.java:47)
at org.jclouds.util.Suppliers2$ExpiringMemoizingSupplier.get(Suppliers2.java:130)
at org.jclouds.rest.suppliers.MemoizedRetryOnTimeOutButNotOnAuthorizationExceptionSupplier.get(MemoizedRetryOnTimeOutButNotOnAuthorizationExceptionSupplier.java:64)
at org.jclouds.compute.domain.internal.TemplateBuilderImpl.getImages(TemplateBuilderImpl.java:737)
at org.jclouds.compute.domain.internal.TemplateBuilderImpl.build(TemplateBuilderImpl.java:612)
at org.jclouds.compute.internal.BaseTemplateBuilderLiveTest.testTemplateBuilderCannotFind(BaseTemplateBuilderLiveTest.java:154)
at sun.reflect.NativeMethodAccessorImpl.invoke0(Native Method)
at sun.reflect.NativeMethodAccessorImpl.invoke(NativeMethodAccessorImpl.java:39)
at sun.reflect.DelegatingMethodAccessorImpl.invoke(DelegatingMethodAccessorImpl.java:25)
at java.lang.reflect.Method.invoke(Method.java:597)
at org.testng.internal.MethodInvocationHelper.invokeMethod(MethodInvocationHelper.java:80)
at org.testng.internal.Invoker.invokeMethod(Invoker.java:701)
... 15 more
Caused by: java.lang.ClassCastException: org.jclouds.elasticstack.domain.DriveInfo cannot be cast to java.lang.Comparable
at com.google.common.collect.NaturalOrdering.compare(NaturalOrdering.java:28)
at java.util.Arrays.mergeSort(Arrays.java:1270)
at java.util.Arrays.sort(Arrays.java:1210)
at com.google.common.collect.SortedIterables.sortedUnique(SortedIterables.java:95)
at com.google.common.collect.ImmutableSortedSet.copyOfInternal(ImmutableSortedSet.java:408)
at com.google.common.collect.ImmutableSortedSet.copyOf(ImmutableSortedSet.java:343)
at com.google.common.collect.ImmutableSortedSet.copyOf(ImmutableSortedSet.java:251)
at org.jclouds.util.Iterables2.concreteCopy(Iterables2.java:37)
at org.jclouds.elasticstack.compute.ElasticStackComputeServiceAdapter.listImages(ElasticStackComputeServiceAdapter.java:187)
at org.jclouds.compute.config.ComputeServiceAdapterContextModule$2.get(ComputeServiceAdapterContextModule.java:116)
at org.jclouds.compute.config.ComputeServiceAdapterContextModule$2.get(ComputeServiceAdapterContextModule.java:112)
at org.jclouds.collect.TransformingSetSupplier.get(TransformingSetSupplier.java:47)
at org.jclouds.collect.TransformingSetSupplier.get(TransformingSetSupplier.java:36)
at org.jclouds.compute.config.BaseComputeServiceContextModule$9.get(BaseComputeServiceContextModule.java:247)
at org.jclouds.compute.config.BaseComputeServiceContextModule$9.get(BaseComputeServiceContextModule.java:244)
at org.jclouds.rest.suppliers.SetAndThrowAuthorizationExceptionSupplier.get(SetAndThrowAuthorizationExceptionSupplier.java:49)
at org.jclouds.concurrent.RetryOnTimeOutExceptionSupplier.get(RetryOnTimeOutExceptionSupplier.java:47)
at org.jclouds.util.Suppliers2$ExpiringMemoizingSupplier.get(Suppliers2.java:130)
at org.jclouds.rest.suppliers.MemoizedRetryOnTimeOutButNotOnAuthorizationExceptionSupplier.get(MemoizedRetryOnTimeOutButNotOnAuthorizationExceptionSupplier.java:64)
at org.jclouds.compute.domain.internal.TemplateBuilderImpl.getImages(TemplateBuilderImpl.java:737)
at org.jclouds.compute.domain.internal.TemplateBuilderImpl.build(TemplateBuilderImpl.java:612)
at org.jclouds.compute.internal.BaseTemplateBuilderLiveTest.testTemplateBuilderCannotFind(BaseTemplateBuilderLiveTest.java:154)
at sun.reflect.NativeMethodAccessorImpl.invoke0(Native Method)
at sun.reflect.NativeMethodAccessorImpl.invoke(NativeMethodAccessorImpl.java:39)
at sun.reflect.DelegatingMethodAccessorImpl.invoke(DelegatingMethodAccessorImpl.java:25)
at java.lang.reflect.Method.invoke(Method.java:597)
at org.testng.internal.MethodInvocationHelper.invokeMethod(MethodInvocationHelper.java:80)
at org.testng.internal.Invoker.invokeMethod(Invoker.java:701)
... 15 more
testImagesCache(org.jclouds.go2cloud.compute.Go2CloudJohannesburg1ComputeServiceLiveTest) Time elapsed: 0.316 sec <<< FAILURE!
java.lang.ClassCastException: org.jclouds.elasticstack.domain.DriveInfo cannot be cast to java.lang.Comparable
at com.google.common.collect.NaturalOrdering.compare(NaturalOrdering.java:28)
at java.util.Arrays.mergeSort(Arrays.java:1270)
at java.util.Arrays.sort(Arrays.java:1210)
at com.google.common.collect.SortedIterables.sortedUnique(SortedIterables.java:95)
at com.google.common.collect.ImmutableSortedSet.copyOfInternal(ImmutableSortedSet.java:408)
at com.google.common.collect.ImmutableSortedSet.copyOf(ImmutableSortedSet.java:343)
at com.google.common.collect.ImmutableSortedSet.copyOf(ImmutableSortedSet.java:251)
at org.jclouds.util.Iterables2.concreteCopy(Iterables2.java:37)
at org.jclouds.elasticstack.compute.ElasticStackComputeServiceAdapter.listImages(ElasticStackComputeServiceAdapter.java:187)
at org.jclouds.compute.config.ComputeServiceAdapterContextModule$2.get(ComputeServiceAdapterContextModule.java:116)
at org.jclouds.compute.config.ComputeServiceAdapterContextModule$2.get(ComputeServiceAdapterContextModule.java:112)
at org.jclouds.collect.TransformingSetSupplier.get(TransformingSetSupplier.java:47)
at org.jclouds.collect.TransformingSetSupplier.get(TransformingSetSupplier.java:36)
at org.jclouds.compute.config.BaseComputeServiceContextModule$9.get(BaseComputeServiceContextModule.java:247)
at org.jclouds.compute.config.BaseComputeServiceContextModule$9.get(BaseComputeServiceContextModule.java:244)
at org.jclouds.rest.suppliers.SetAndThrowAuthorizationExceptionSupplier.get(SetAndThrowAuthorizationExceptionSupplier.java:49)
at org.jclouds.concurrent.RetryOnTimeOutExceptionSupplier.get(RetryOnTimeOutExceptionSupplier.java:47)
at org.jclouds.util.Suppliers2$ExpiringMemoizingSupplier.get(Suppliers2.java:130)
at org.jclouds.rest.suppliers.MemoizedRetryOnTimeOutButNotOnAuthorizationExceptionSupplier.get(MemoizedRetryOnTimeOutButNotOnAuthorizationExceptionSupplier.java:64)
at org.jclouds.compute.internal.BaseComputeService.listImages(BaseComputeService.java:364)
at org.jclouds.compute.internal.BaseComputeServiceLiveTest.testImagesCache(BaseComputeServiceLiveTest.java:191)
at sun.reflect.NativeMethodAccessorImpl.invoke0(Native Method)
at sun.reflect.NativeMethodAccessorImpl.invoke(NativeMethodAccessorImpl.java:39)
at sun.reflect.DelegatingMethodAccessorImpl.invoke(DelegatingMethodAccessorImpl.java:25)
at java.lang.reflect.Method.invoke(Method.java:597)
at org.testng.internal.MethodInvocationHelper.invokeMethod(MethodInvocationHelper.java:80)
at org.testng.internal.Invoker.invokeMethod(Invoker.java:701)
at org.testng.internal.Invoker.invokeTestMethod(Invoker.java:893)
at org.testng.internal.Invoker.invokeTestMethods(Invoker.java:1218)
at org.testng.internal.TestMethodWorker.invokeTestMethods(TestMethodWorker.java:127)
at org.testng.internal.TestMethodWorker.run(TestMethodWorker.java:111)
at org.testng.TestRunner.privateRun(TestRunner.java:758)
at org.testng.TestRunner.run(TestRunner.java:613)
at org.testng.SuiteRunner.runTest(SuiteRunner.java:334)
at org.testng.SuiteRunner.access$000(SuiteRunner.java:37)
at org.testng.SuiteRunner$SuiteWorker.run(SuiteRunner.java:368)
at org.testng.internal.thread.ThreadUtil$2.call(ThreadUtil.java:64)
at java.util.concurrent.FutureTask$Sync.innerRun(FutureTask.java:303)
at java.util.concurrent.FutureTask.run(FutureTask.java:138)
at java.util.concurrent.ThreadPoolExecutor$Worker.runTask(ThreadPoolExecutor.java:886)
at java.util.concurrent.ThreadPoolExecutor$Worker.run(ThreadPoolExecutor.java:908)
at java.lang.Thread.run(Thread.java:680)
testTemplateBuilderCannotFind(org.jclouds.go2cloud.compute.Go2CloudJohannesburg1TemplateBuilderLiveTest) Time elapsed: 0.607 sec <<< FAILURE!
org.testng.TestException:
Expected exception java.util.NoSuchElementException but got java.lang.ClassCastException: org.jclouds.elasticstack.domain.DriveInfo cannot be cast to java.lang.Comparable
at org.testng.internal.Invoker.handleInvocationResults(Invoker.java:1475)
at org.testng.internal.Invoker.invokeMethod(Invoker.java:750)
at org.testng.internal.Invoker.invokeTestMethod(Invoker.java:893)
at org.testng.internal.Invoker.invokeTestMethods(Invoker.java:1218)
at org.testng.internal.TestMethodWorker.invokeTestMethods(TestMethodWorker.java:127)
at org.testng.internal.TestMethodWorker.run(TestMethodWorker.java:111)
at org.testng.TestRunner.privateRun(TestRunner.java:758)
at org.testng.TestRunner.run(TestRunner.java:613)
at org.testng.SuiteRunner.runTest(SuiteRunner.java:334)
at org.testng.SuiteRunner.access$000(SuiteRunner.java:37)
at org.testng.SuiteRunner$SuiteWorker.run(SuiteRunner.java:368)
at org.testng.internal.thread.ThreadUtil$2.call(ThreadUtil.java:64)
at java.util.concurrent.FutureTask$Sync.innerRun(FutureTask.java:303)
at java.util.concurrent.FutureTask.run(FutureTask.java:138)
at java.util.concurrent.ThreadPoolExecutor$Worker.runTask(ThreadPoolExecutor.java:886)
at java.util.concurrent.ThreadPoolExecutor$Worker.run(ThreadPoolExecutor.java:908)
at java.lang.Thread.run(Thread.java:680)
Caused by: java.lang.ClassCastException: org.jclouds.elasticstack.domain.DriveInfo cannot be cast to java.lang.Comparable
at com.google.common.collect.NaturalOrdering.compare(NaturalOrdering.java:28)
at java.util.Arrays.mergeSort(Arrays.java:1270)
at java.util.Arrays.sort(Arrays.java:1210)
at com.google.common.collect.SortedIterables.sortedUnique(SortedIterables.java:95)
at com.google.common.collect.ImmutableSortedSet.copyOfInternal(ImmutableSortedSet.java:408)
at com.google.common.collect.ImmutableSortedSet.copyOf(ImmutableSortedSet.java:343)
at com.google.common.collect.ImmutableSortedSet.copyOf(ImmutableSortedSet.java:251)
at org.jclouds.util.Iterables2.concreteCopy(Iterables2.java:37)
at org.jclouds.elasticstack.compute.ElasticStackComputeServiceAdapter.listImages(ElasticStackComputeServiceAdapter.java:187)
at org.jclouds.compute.config.ComputeServiceAdapterContextModule$2.get(ComputeServiceAdapterContextModule.java:116)
at org.jclouds.compute.config.ComputeServiceAdapterContextModule$2.get(ComputeServiceAdapterContextModule.java:112)
at org.jclouds.collect.TransformingSetSupplier.get(TransformingSetSupplier.java:47)
at org.jclouds.collect.TransformingSetSupplier.get(TransformingSetSupplier.java:36)
at org.jclouds.compute.config.BaseComputeServiceContextModule$9.get(BaseComputeServiceContextModule.java:247)
at org.jclouds.compute.config.BaseComputeServiceContextModule$9.get(BaseComputeServiceContextModule.java:244)
at org.jclouds.rest.suppliers.SetAndThrowAuthorizationExceptionSupplier.get(SetAndThrowAuthorizationExceptionSupplier.java:49)
at org.jclouds.concurrent.RetryOnTimeOutExceptionSupplier.get(RetryOnTimeOutExceptionSupplier.java:47)
at org.jclouds.util.Suppliers2$ExpiringMemoizingSupplier.get(Suppliers2.java:130)
at org.jclouds.rest.suppliers.MemoizedRetryOnTimeOutButNotOnAuthorizationExceptionSupplier.get(MemoizedRetryOnTimeOutButNotOnAuthorizationExceptionSupplier.java:64)
at org.jclouds.compute.domain.internal.TemplateBuilderImpl.getImages(TemplateBuilderImpl.java:737)
at org.jclouds.compute.domain.internal.TemplateBuilderImpl.build(TemplateBuilderImpl.java:612)
at org.jclouds.compute.internal.BaseTemplateBuilderLiveTest.testTemplateBuilderCannotFind(BaseTemplateBuilderLiveTest.java:154)
at sun.reflect.NativeMethodAccessorImpl.invoke0(Native Method)
at sun.reflect.NativeMethodAccessorImpl.invoke(NativeMethodAccessorImpl.java:39)
at sun.reflect.DelegatingMethodAccessorImpl.invoke(DelegatingMethodAccessorImpl.java:25)
at java.lang.reflect.Method.invoke(Method.java:597)
at org.testng.internal.MethodInvocationHelper.invokeMethod(MethodInvocationHelper.java:80)
at org.testng.internal.Invoker.invokeMethod(Invoker.java:701)
... 15 more
Caused by: java.lang.ClassCastException: org.jclouds.elasticstack.domain.DriveInfo cannot be cast to java.lang.Comparable
at com.google.common.collect.NaturalOrdering.compare(NaturalOrdering.java:28)
at java.util.Arrays.mergeSort(Arrays.java:1270)
at java.util.Arrays.sort(Arrays.java:1210)
at com.google.common.collect.SortedIterables.sortedUnique(SortedIterables.java:95)
at com.google.common.collect.ImmutableSortedSet.copyOfInternal(ImmutableSortedSet.java:408)
at com.google.common.collect.ImmutableSortedSet.copyOf(ImmutableSortedSet.java:343)
at com.google.common.collect.ImmutableSortedSet.copyOf(ImmutableSortedSet.java:251)
at org.jclouds.util.Iterables2.concreteCopy(Iterables2.java:37)
at org.jclouds.elasticstack.compute.ElasticStackComputeServiceAdapter.listImages(ElasticStackComputeServiceAdapter.java:187)
at org.jclouds.compute.config.ComputeServiceAdapterContextModule$2.get(ComputeServiceAdapterContextModule.java:116)
at org.jclouds.compute.config.ComputeServiceAdapterContextModule$2.get(ComputeServiceAdapterContextModule.java:112)
at org.jclouds.collect.TransformingSetSupplier.get(TransformingSetSupplier.java:47)
at org.jclouds.collect.TransformingSetSupplier.get(TransformingSetSupplier.java:36)
at org.jclouds.compute.config.BaseComputeServiceContextModule$9.get(BaseComputeServiceContextModule.java:247)
at org.jclouds.compute.config.BaseComputeServiceContextModule$9.get(BaseComputeServiceContextModule.java:244)
at org.jclouds.rest.suppliers.SetAndThrowAuthorizationExceptionSupplier.get(SetAndThrowAuthorizationExceptionSupplier.java:49)
at org.jclouds.concurrent.RetryOnTimeOutExceptionSupplier.get(RetryOnTimeOutExceptionSupplier.java:47)
at org.jclouds.util.Suppliers2$ExpiringMemoizingSupplier.get(Suppliers2.java:130)
at org.jclouds.rest.suppliers.MemoizedRetryOnTimeOutButNotOnAuthorizationExceptionSupplier.get(MemoizedRetryOnTimeOutButNotOnAuthorizationExceptionSupplier.java:64)
at org.jclouds.compute.domain.internal.TemplateBuilderImpl.getImages(TemplateBuilderImpl.java:737)
at org.jclouds.compute.domain.internal.TemplateBuilderImpl.build(TemplateBuilderImpl.java:612)
at org.jclouds.compute.internal.BaseTemplateBuilderLiveTest.testTemplateBuilderCannotFind(BaseTemplateBuilderLiveTest.java:154)
at sun.reflect.NativeMethodAccessorImpl.invoke0(Native Method)
at sun.reflect.NativeMethodAccessorImpl.invoke(NativeMethodAccessorImpl.java:39)
at sun.reflect.DelegatingMethodAccessorImpl.invoke(DelegatingMethodAccessorImpl.java:25)
at java.lang.reflect.Method.invoke(Method.java:597)
at org.testng.internal.MethodInvocationHelper.invokeMethod(MethodInvocationHelper.java:80)
at org.testng.internal.Invoker.invokeMethod(Invoker.java:701)
... 15 more
testListImages(org.jclouds.go2cloud.compute.Go2CloudJohannesburg1ComputeServiceLiveTest) Time elapsed: 0.368 sec <<< FAILURE!
java.lang.ClassCastException: org.jclouds.elasticstack.domain.DriveInfo cannot be cast to java.lang.Comparable
at com.google.common.collect.NaturalOrdering.compare(NaturalOrdering.java:28)
at java.util.Arrays.mergeSort(Arrays.java:1270)
at java.util.Arrays.sort(Arrays.java:1210)
at com.google.common.collect.SortedIterables.sortedUnique(SortedIterables.java:95)
at com.google.common.collect.ImmutableSortedSet.copyOfInternal(ImmutableSortedSet.java:408)
at com.google.common.collect.ImmutableSortedSet.copyOf(ImmutableSortedSet.java:343)
at com.google.common.collect.ImmutableSortedSet.copyOf(ImmutableSortedSet.java:251)
at org.jclouds.util.Iterables2.concreteCopy(Iterables2.java:37)
at org.jclouds.elasticstack.compute.ElasticStackComputeServiceAdapter.listImages(ElasticStackComputeServiceAdapter.java:187)
at org.jclouds.compute.config.ComputeServiceAdapterContextModule$2.get(ComputeServiceAdapterContextModule.java:116)
at org.jclouds.compute.config.ComputeServiceAdapterContextModule$2.get(ComputeServiceAdapterContextModule.java:112)
at org.jclouds.collect.TransformingSetSupplier.get(TransformingSetSupplier.java:47)
at org.jclouds.collect.TransformingSetSupplier.get(TransformingSetSupplier.java:36)
at org.jclouds.compute.config.BaseComputeServiceContextModule$9.get(BaseComputeServiceContextModule.java:247)
at org.jclouds.compute.config.BaseComputeServiceContextModule$9.get(BaseComputeServiceContextModule.java:244)
at org.jclouds.rest.suppliers.SetAndThrowAuthorizationExceptionSupplier.get(SetAndThrowAuthorizationExceptionSupplier.java:49)
at org.jclouds.concurrent.RetryOnTimeOutExceptionSupplier.get(RetryOnTimeOutExceptionSupplier.java:47)
at org.jclouds.util.Suppliers2$ExpiringMemoizingSupplier.get(Suppliers2.java:130)
at org.jclouds.rest.suppliers.MemoizedRetryOnTimeOutButNotOnAuthorizationExceptionSupplier.get(MemoizedRetryOnTimeOutButNotOnAuthorizationExceptionSupplier.java:64)
at org.jclouds.compute.internal.BaseComputeService.listImages(BaseComputeService.java:364)
at org.jclouds.compute.internal.BaseComputeServiceLiveTest.testListImages(BaseComputeServiceLiveTest.java:699)
at sun.reflect.NativeMethodAccessorImpl.invoke0(Native Method)
at sun.reflect.NativeMethodAccessorImpl.invoke(NativeMethodAccessorImpl.java:39)
at sun.reflect.DelegatingMethodAccessorImpl.invoke(DelegatingMethodAccessorImpl.java:25)
at java.lang.reflect.Method.invoke(Method.java:597)
at org.testng.internal.MethodInvocationHelper.invokeMethod(MethodInvocationHelper.java:80)
at org.testng.internal.Invoker.invokeMethod(Invoker.java:701)
at org.testng.internal.Invoker.invokeTestMethod(Invoker.java:893)
at org.testng.internal.Invoker.invokeTestMethods(Invoker.java:1218)
at org.testng.internal.TestMethodWorker.invokeTestMethods(TestMethodWorker.java:127)
at org.testng.internal.TestMethodWorker.run(TestMethodWorker.java:111)
at org.testng.TestRunner.privateRun(TestRunner.java:758)
at org.testng.TestRunner.run(TestRunner.java:613)
at org.testng.SuiteRunner.runTest(SuiteRunner.java:334)
at org.testng.SuiteRunner.access$000(SuiteRunner.java:37)
at org.testng.SuiteRunner$SuiteWorker.run(SuiteRunner.java:368)
at org.testng.internal.thread.ThreadUtil$2.call(ThreadUtil.java:64)
at java.util.concurrent.FutureTask$Sync.innerRun(FutureTask.java:303)
at java.util.concurrent.FutureTask.run(FutureTask.java:138)
at java.util.concurrent.ThreadPoolExecutor$Worker.runTask(ThreadPoolExecutor.java:886)
at java.util.concurrent.ThreadPoolExecutor$Worker.run(ThreadPoolExecutor.java:908)
at java.lang.Thread.run(Thread.java:680)
testTemplateBuilderCannotFind(org.jclouds.go2cloud.compute.Go2CloudJohannesburg1TemplateBuilderLiveTest) Time elapsed: 0.546 sec <<< FAILURE!
org.testng.TestException:
Expected exception java.util.NoSuchElementException but got java.lang.ClassCastException: org.jclouds.elasticstack.domain.DriveInfo cannot be cast to java.lang.Comparable
at org.testng.internal.Invoker.handleInvocationResults(Invoker.java:1475)
at org.testng.internal.Invoker.invokeMethod(Invoker.java:750)
at org.testng.internal.Invoker.invokeTestMethod(Invoker.java:893)
at org.testng.internal.Invoker.invokeTestMethods(Invoker.java:1218)
at org.testng.internal.TestMethodWorker.invokeTestMethods(TestMethodWorker.java:127)
at org.testng.internal.TestMethodWorker.run(TestMethodWorker.java:111)
at org.testng.TestRunner.privateRun(TestRunner.java:758)
at org.testng.TestRunner.run(TestRunner.java:613)
at org.testng.SuiteRunner.runTest(SuiteRunner.java:334)
at org.testng.SuiteRunner.access$000(SuiteRunner.java:37)
at org.testng.SuiteRunner$SuiteWorker.run(SuiteRunner.java:368)
at org.testng.internal.thread.ThreadUtil$2.call(ThreadUtil.java:64)
at java.util.concurrent.FutureTask$Sync.innerRun(FutureTask.java:303)
at java.util.concurrent.FutureTask.run(FutureTask.java:138)
at java.util.concurrent.ThreadPoolExecutor$Worker.runTask(ThreadPoolExecutor.java:886)
at java.util.concurrent.ThreadPoolExecutor$Worker.run(ThreadPoolExecutor.java:908)
at java.lang.Thread.run(Thread.java:680)
Caused by: java.lang.ClassCastException: org.jclouds.elasticstack.domain.DriveInfo cannot be cast to java.lang.Comparable
at com.google.common.collect.NaturalOrdering.compare(NaturalOrdering.java:28)
at java.util.Arrays.mergeSort(Arrays.java:1270)
at java.util.Arrays.sort(Arrays.java:1210)
at com.google.common.collect.SortedIterables.sortedUnique(SortedIterables.java:95)
at com.google.common.collect.ImmutableSortedSet.copyOfInternal(ImmutableSortedSet.java:408)
at com.google.common.collect.ImmutableSortedSet.copyOf(ImmutableSortedSet.java:343)
at com.google.common.collect.ImmutableSortedSet.copyOf(ImmutableSortedSet.java:251)
at org.jclouds.util.Iterables2.concreteCopy(Iterables2.java:37)
at org.jclouds.elasticstack.compute.ElasticStackComputeServiceAdapter.listImages(ElasticStackComputeServiceAdapter.java:187)
at org.jclouds.compute.config.ComputeServiceAdapterContextModule$2.get(ComputeServiceAdapterContextModule.java:116)
at org.jclouds.compute.config.ComputeServiceAdapterContextModule$2.get(ComputeServiceAdapterContextModule.java:112)
at org.jclouds.collect.TransformingSetSupplier.get(TransformingSetSupplier.java:47)
at org.jclouds.collect.TransformingSetSupplier.get(TransformingSetSupplier.java:36)
at org.jclouds.compute.config.BaseComputeServiceContextModule$9.get(BaseComputeServiceContextModule.java:247)
at org.jclouds.compute.config.BaseComputeServiceContextModule$9.get(BaseComputeServiceContextModule.java:244)
at org.jclouds.rest.suppliers.SetAndThrowAuthorizationExceptionSupplier.get(SetAndThrowAuthorizationExceptionSupplier.java:49)
at org.jclouds.concurrent.RetryOnTimeOutExceptionSupplier.get(RetryOnTimeOutExceptionSupplier.java:47)
at org.jclouds.util.Suppliers2$ExpiringMemoizingSupplier.get(Suppliers2.java:130)
at org.jclouds.rest.suppliers.MemoizedRetryOnTimeOutButNotOnAuthorizationExceptionSupplier.get(MemoizedRetryOnTimeOutButNotOnAuthorizationExceptionSupplier.java:64)
at org.jclouds.compute.domain.internal.TemplateBuilderImpl.getImages(TemplateBuilderImpl.java:737)
at org.jclouds.compute.domain.internal.TemplateBuilderImpl.build(TemplateBuilderImpl.java:612)
at org.jclouds.compute.internal.BaseTemplateBuilderLiveTest.testTemplateBuilderCannotFind(BaseTemplateBuilderLiveTest.java:154)
at sun.reflect.NativeMethodAccessorImpl.invoke0(Native Method)
at sun.reflect.NativeMethodAccessorImpl.invoke(NativeMethodAccessorImpl.java:39)
at sun.reflect.DelegatingMethodAccessorImpl.invoke(DelegatingMethodAccessorImpl.java:25)
at java.lang.reflect.Method.invoke(Method.java:597)
at org.testng.internal.MethodInvocationHelper.invokeMethod(MethodInvocationHelper.java:80)
at org.testng.internal.Invoker.invokeMethod(Invoker.java:701)
... 15 more
Caused by: java.lang.ClassCastException: org.jclouds.elasticstack.domain.DriveInfo cannot be cast to java.lang.Comparable
at com.google.common.collect.NaturalOrdering.compare(NaturalOrdering.java:28)
at java.util.Arrays.mergeSort(Arrays.java:1270)
at java.util.Arrays.sort(Arrays.java:1210)
at com.google.common.collect.SortedIterables.sortedUnique(SortedIterables.java:95)
at com.google.common.collect.ImmutableSortedSet.copyOfInternal(ImmutableSortedSet.java:408)
at com.google.common.collect.ImmutableSortedSet.copyOf(ImmutableSortedSet.java:343)
at com.google.common.collect.ImmutableSortedSet.copyOf(ImmutableSortedSet.java:251)
at org.jclouds.util.Iterables2.concreteCopy(Iterables2.java:37)
at org.jclouds.elasticstack.compute.ElasticStackComputeServiceAdapter.listImages(ElasticStackComputeServiceAdapter.java:187)
at org.jclouds.compute.config.ComputeServiceAdapterContextModule$2.get(ComputeServiceAdapterContextModule.java:116)
at org.jclouds.compute.config.ComputeServiceAdapterContextModule$2.get(ComputeServiceAdapterContextModule.java:112)
at org.jclouds.collect.TransformingSetSupplier.get(TransformingSetSupplier.java:47)
at org.jclouds.collect.TransformingSetSupplier.get(TransformingSetSupplier.java:36)
at org.jclouds.compute.config.BaseComputeServiceContextModule$9.get(BaseComputeServiceContextModule.java:247)
at org.jclouds.compute.config.BaseComputeServiceContextModule$9.get(BaseComputeServiceContextModule.java:244)
at org.jclouds.rest.suppliers.SetAndThrowAuthorizationExceptionSupplier.get(SetAndThrowAuthorizationExceptionSupplier.java:49)
at org.jclouds.concurrent.RetryOnTimeOutExceptionSupplier.get(RetryOnTimeOutExceptionSupplier.java:47)
at org.jclouds.util.Suppliers2$ExpiringMemoizingSupplier.get(Suppliers2.java:130)
at org.jclouds.rest.suppliers.MemoizedRetryOnTimeOutButNotOnAuthorizationExceptionSupplier.get(MemoizedRetryOnTimeOutButNotOnAuthorizationExceptionSupplier.java:64)
at org.jclouds.compute.domain.internal.TemplateBuilderImpl.getImages(TemplateBuilderImpl.java:737)
at org.jclouds.compute.domain.internal.TemplateBuilderImpl.build(TemplateBuilderImpl.java:612)
at org.jclouds.compute.internal.BaseTemplateBuilderLiveTest.testTemplateBuilderCannotFind(BaseTemplateBuilderLiveTest.java:154)
at sun.reflect.NativeMethodAccessorImpl.invoke0(Native Method)
at sun.reflect.NativeMethodAccessorImpl.invoke(NativeMethodAccessorImpl.java:39)
at sun.reflect.DelegatingMethodAccessorImpl.invoke(DelegatingMethodAccessorImpl.java:25)
at java.lang.reflect.Method.invoke(Method.java:597)
at org.testng.internal.MethodInvocationHelper.invokeMethod(MethodInvocationHelper.java:80)
at org.testng.internal.Invoker.invokeMethod(Invoker.java:701)
... 15 more
testTemplateBuilderCannotFind(org.jclouds.go2cloud.compute.Go2CloudJohannesburg1TemplateBuilderLiveTest) Time elapsed: 1.06 sec <<< FAILURE!
org.testng.TestException:
Expected exception java.util.NoSuchElementException but got java.lang.ClassCastException: org.jclouds.elasticstack.domain.DriveInfo cannot be cast to java.lang.Comparable
at org.testng.internal.Invoker.handleInvocationResults(Invoker.java:1475)
at org.testng.internal.Invoker.invokeMethod(Invoker.java:750)
at org.testng.internal.Invoker.invokeTestMethod(Invoker.java:893)
at org.testng.internal.Invoker.invokeTestMethods(Invoker.java:1218)
at org.testng.internal.TestMethodWorker.invokeTestMethods(TestMethodWorker.java:127)
at org.testng.internal.TestMethodWorker.run(TestMethodWorker.java:111)
at org.testng.TestRunner.privateRun(TestRunner.java:758)
at org.testng.TestRunner.run(TestRunner.java:613)
at org.testng.SuiteRunner.runTest(SuiteRunner.java:334)
at org.testng.SuiteRunner.access$000(SuiteRunner.java:37)
at org.testng.SuiteRunner$SuiteWorker.run(SuiteRunner.java:368)
at org.testng.internal.thread.ThreadUtil$2.call(ThreadUtil.java:64)
at java.util.concurrent.FutureTask$Sync.innerRun(FutureTask.java:303)
at java.util.concurrent.FutureTask.run(FutureTask.java:138)
at java.util.concurrent.ThreadPoolExecutor$Worker.runTask(ThreadPoolExecutor.java:886)
at java.util.concurrent.ThreadPoolExecutor$Worker.run(ThreadPoolExecutor.java:908)
at java.lang.Thread.run(Thread.java:680)
Caused by: java.lang.ClassCastException: org.jclouds.elasticstack.domain.DriveInfo cannot be cast to java.lang.Comparable
at com.google.common.collect.NaturalOrdering.compare(NaturalOrdering.java:28)
at java.util.Arrays.mergeSort(Arrays.java:1270)
at java.util.Arrays.sort(Arrays.java:1210)
at com.google.common.collect.SortedIterables.sortedUnique(SortedIterables.java:95)
at com.google.common.collect.ImmutableSortedSet.copyOfInternal(ImmutableSortedSet.java:408)
at com.google.common.collect.ImmutableSortedSet.copyOf(ImmutableSortedSet.java:343)
at com.google.common.collect.ImmutableSortedSet.copyOf(ImmutableSortedSet.java:251)
at org.jclouds.util.Iterables2.concreteCopy(Iterables2.java:37)
at org.jclouds.elasticstack.compute.ElasticStackComputeServiceAdapter.listImages(ElasticStackComputeServiceAdapter.java:187)
at org.jclouds.compute.config.ComputeServiceAdapterContextModule$2.get(ComputeServiceAdapterContextModule.java:116)
at org.jclouds.compute.config.ComputeServiceAdapterContextModule$2.get(ComputeServiceAdapterContextModule.java:112)
at org.jclouds.collect.TransformingSetSupplier.get(TransformingSetSupplier.java:47)
at org.jclouds.collect.TransformingSetSupplier.get(TransformingSetSupplier.java:36)
at org.jclouds.compute.config.BaseComputeServiceContextModule$9.get(BaseComputeServiceContextModule.java:247)
at org.jclouds.compute.config.BaseComputeServiceContextModule$9.get(BaseComputeServiceContextModule.java:244)
at org.jclouds.rest.suppliers.SetAndThrowAuthorizationExceptionSupplier.get(SetAndThrowAuthorizationExceptionSupplier.java:49)
at org.jclouds.concurrent.RetryOnTimeOutExceptionSupplier.get(RetryOnTimeOutExceptionSupplier.java:47)
at org.jclouds.util.Suppliers2$ExpiringMemoizingSupplier.get(Suppliers2.java:130)
at org.jclouds.rest.suppliers.MemoizedRetryOnTimeOutButNotOnAuthorizationExceptionSupplier.get(MemoizedRetryOnTimeOutButNotOnAuthorizationExceptionSupplier.java:64)
at org.jclouds.compute.domain.internal.TemplateBuilderImpl.getImages(TemplateBuilderImpl.java:737)
at org.jclouds.compute.domain.internal.TemplateBuilderImpl.build(TemplateBuilderImpl.java:612)
at org.jclouds.compute.internal.BaseTemplateBuilderLiveTest.testTemplateBuilderCannotFind(BaseTemplateBuilderLiveTest.java:154)
at sun.reflect.NativeMethodAccessorImpl.invoke0(Native Method)
at sun.reflect.NativeMethodAccessorImpl.invoke(NativeMethodAccessorImpl.java:39)
at sun.reflect.DelegatingMethodAccessorImpl.invoke(DelegatingMethodAccessorImpl.java:25)
at java.lang.reflect.Method.invoke(Method.java:597)
at org.testng.internal.MethodInvocationHelper.invokeMethod(MethodInvocationHelper.java:80)
at org.testng.internal.Invoker.invokeMethod(Invoker.java:701)
... 15 more
Caused by: java.lang.ClassCastException: org.jclouds.elasticstack.domain.DriveInfo cannot be cast to java.lang.Comparable
at com.google.common.collect.NaturalOrdering.compare(NaturalOrdering.java:28)
at java.util.Arrays.mergeSort(Arrays.java:1270)
at java.util.Arrays.sort(Arrays.java:1210)
at com.google.common.collect.SortedIterables.sortedUnique(SortedIterables.java:95)
at com.google.common.collect.ImmutableSortedSet.copyOfInternal(ImmutableSortedSet.java:408)
at com.google.common.collect.ImmutableSortedSet.copyOf(ImmutableSortedSet.java:343)
at com.google.common.collect.ImmutableSortedSet.copyOf(ImmutableSortedSet.java:251)
at org.jclouds.util.Iterables2.concreteCopy(Iterables2.java:37)
at org.jclouds.elasticstack.compute.ElasticStackComputeServiceAdapter.listImages(ElasticStackComputeServiceAdapter.java:187)
at org.jclouds.compute.config.ComputeServiceAdapterContextModule$2.get(ComputeServiceAdapterContextModule.java:116)
at org.jclouds.compute.config.ComputeServiceAdapterContextModule$2.get(ComputeServiceAdapterContextModule.java:112)
at org.jclouds.collect.TransformingSetSupplier.get(TransformingSetSupplier.java:47)
at org.jclouds.collect.TransformingSetSupplier.get(TransformingSetSupplier.java:36)
at org.jclouds.compute.config.BaseComputeServiceContextModule$9.get(BaseComputeServiceContextModule.java:247)
at org.jclouds.compute.config.BaseComputeServiceContextModule$9.get(BaseComputeServiceContextModule.java:244)
at org.jclouds.rest.suppliers.SetAndThrowAuthorizationExceptionSupplier.get(SetAndThrowAuthorizationExceptionSupplier.java:49)
at org.jclouds.concurrent.RetryOnTimeOutExceptionSupplier.get(RetryOnTimeOutExceptionSupplier.java:47)
at org.jclouds.util.Suppliers2$ExpiringMemoizingSupplier.get(Suppliers2.java:130)
at org.jclouds.rest.suppliers.MemoizedRetryOnTimeOutButNotOnAuthorizationExceptionSupplier.get(MemoizedRetryOnTimeOutButNotOnAuthorizationExceptionSupplier.java:64)
at org.jclouds.compute.domain.internal.TemplateBuilderImpl.getImages(TemplateBuilderImpl.java:737)
at org.jclouds.compute.domain.internal.TemplateBuilderImpl.build(TemplateBuilderImpl.java:612)
at org.jclouds.compute.internal.BaseTemplateBuilderLiveTest.testTemplateBuilderCannotFind(BaseTemplateBuilderLiveTest.java:154)
at sun.reflect.NativeMethodAccessorImpl.invoke0(Native Method)
at sun.reflect.NativeMethodAccessorImpl.invoke(NativeMethodAccessorImpl.java:39)
at sun.reflect.DelegatingMethodAccessorImpl.invoke(DelegatingMethodAccessorImpl.java:25)
at java.lang.reflect.Method.invoke(Method.java:597)
at org.testng.internal.MethodInvocationHelper.invokeMethod(MethodInvocationHelper.java:80)
at org.testng.internal.Invoker.invokeMethod(Invoker.java:701)
... 15 more
testCorrectExceptionRunningNodesNotFound(org.jclouds.go2cloud.compute.Go2CloudJohannesburg1ComputeServiceLiveTest) Time elapsed: 0.267 sec <<< FAILURE!
org.testng.TestException:
Expected exception java.util.NoSuchElementException but got java.lang.ClassCastException: org.jclouds.elasticstack.domain.DriveInfo cannot be cast to java.lang.Comparable
at org.testng.internal.Invoker.handleInvocationResults(Invoker.java:1475)
at org.testng.internal.Invoker.invokeMethod(Invoker.java:750)
at org.testng.internal.Invoker.invokeTestMethod(Invoker.java:893)
at org.testng.internal.Invoker.invokeTestMethods(Invoker.java:1218)
at org.testng.internal.TestMethodWorker.invokeTestMethods(TestMethodWorker.java:127)
at org.testng.internal.TestMethodWorker.run(TestMethodWorker.java:111)
at org.testng.TestRunner.privateRun(TestRunner.java:758)
at org.testng.TestRunner.run(TestRunner.java:613)
at org.testng.SuiteRunner.runTest(SuiteRunner.java:334)
at org.testng.SuiteRunner.access$000(SuiteRunner.java:37)
at org.testng.SuiteRunner$SuiteWorker.run(SuiteRunner.java:368)
at org.testng.internal.thread.ThreadUtil$2.call(ThreadUtil.java:64)
at java.util.concurrent.FutureTask$Sync.innerRun(FutureTask.java:303)
at java.util.concurrent.FutureTask.run(FutureTask.java:138)
at java.util.concurrent.ThreadPoolExecutor$Worker.runTask(ThreadPoolExecutor.java:886)
at java.util.concurrent.ThreadPoolExecutor$Worker.run(ThreadPoolExecutor.java:908)
at java.lang.Thread.run(Thread.java:680)
Caused by: java.lang.ClassCastException: org.jclouds.elasticstack.domain.DriveInfo cannot be cast to java.lang.Comparable
at com.google.common.collect.NaturalOrdering.compare(NaturalOrdering.java:28)
at java.util.Arrays.mergeSort(Arrays.java:1270)
at java.util.Arrays.sort(Arrays.java:1210)