blob: fdf9d311ee1946ef9f67c6a29f8718d73c283ec3 [file] [log] [blame]
-------------------------------------------------------------------------------
Test set: TestSuite
-------------------------------------------------------------------------------
Tests run: 130, Failures: 96, Errors: 0, Skipped: 28, Time elapsed: 12.282 sec <<< FAILURE!
testCompareSizes(org.jclouds.openhosting.compute.OpenHostingEast1ComputeServiceLiveTest) Time elapsed: 4.031 sec <<< FAILURE!
java.lang.ClassCastException: org.jclouds.elasticstack.domain.DriveInfo cannot be cast to java.lang.Comparable
at com.google.common.collect.NaturalOrdering.compare(NaturalOrdering.java:28)
at java.util.Arrays.mergeSort(Arrays.java:1270)
at java.util.Arrays.mergeSort(Arrays.java:1281)
at java.util.Arrays.sort(Arrays.java:1210)
at com.google.common.collect.SortedIterables.sortedUnique(SortedIterables.java:95)
at com.google.common.collect.ImmutableSortedSet.copyOfInternal(ImmutableSortedSet.java:408)
at com.google.common.collect.ImmutableSortedSet.copyOf(ImmutableSortedSet.java:343)
at com.google.common.collect.ImmutableSortedSet.copyOf(ImmutableSortedSet.java:251)
at org.jclouds.util.Iterables2.concreteCopy(Iterables2.java:37)
at org.jclouds.elasticstack.compute.ElasticStackComputeServiceAdapter.listImages(ElasticStackComputeServiceAdapter.java:187)
at org.jclouds.compute.config.ComputeServiceAdapterContextModule$2.get(ComputeServiceAdapterContextModule.java:116)
at org.jclouds.compute.config.ComputeServiceAdapterContextModule$2.get(ComputeServiceAdapterContextModule.java:112)
at org.jclouds.collect.TransformingSetSupplier.get(TransformingSetSupplier.java:47)
at org.jclouds.collect.TransformingSetSupplier.get(TransformingSetSupplier.java:36)
at org.jclouds.compute.config.BaseComputeServiceContextModule$9.get(BaseComputeServiceContextModule.java:247)
at org.jclouds.compute.config.BaseComputeServiceContextModule$9.get(BaseComputeServiceContextModule.java:244)
at org.jclouds.rest.suppliers.SetAndThrowAuthorizationExceptionSupplier.get(SetAndThrowAuthorizationExceptionSupplier.java:49)
at org.jclouds.concurrent.RetryOnTimeOutExceptionSupplier.get(RetryOnTimeOutExceptionSupplier.java:47)
at org.jclouds.util.Suppliers2$ExpiringMemoizingSupplier.get(Suppliers2.java:130)
at org.jclouds.rest.suppliers.MemoizedRetryOnTimeOutButNotOnAuthorizationExceptionSupplier.get(MemoizedRetryOnTimeOutButNotOnAuthorizationExceptionSupplier.java:64)
at org.jclouds.compute.domain.internal.TemplateBuilderImpl.getImages(TemplateBuilderImpl.java:737)
at org.jclouds.compute.domain.internal.TemplateBuilderImpl.build(TemplateBuilderImpl.java:612)
at org.jclouds.compute.domain.internal.TemplateBuilderImpl.build(TemplateBuilderImpl.java:606)
at org.jclouds.compute.internal.BaseComputeServiceLiveTest.testCompareSizes(BaseComputeServiceLiveTest.java:779)
at sun.reflect.NativeMethodAccessorImpl.invoke0(Native Method)
at sun.reflect.NativeMethodAccessorImpl.invoke(NativeMethodAccessorImpl.java:39)
at sun.reflect.DelegatingMethodAccessorImpl.invoke(DelegatingMethodAccessorImpl.java:25)
at java.lang.reflect.Method.invoke(Method.java:597)
at org.testng.internal.MethodInvocationHelper.invokeMethod(MethodInvocationHelper.java:80)
at org.testng.internal.Invoker.invokeMethod(Invoker.java:701)
at org.testng.internal.Invoker.invokeTestMethod(Invoker.java:893)
at org.testng.internal.Invoker.invokeTestMethods(Invoker.java:1218)
at org.testng.internal.TestMethodWorker.invokeTestMethods(TestMethodWorker.java:127)
at org.testng.internal.TestMethodWorker.run(TestMethodWorker.java:111)
at org.testng.TestRunner.privateRun(TestRunner.java:758)
at org.testng.TestRunner.run(TestRunner.java:613)
at org.testng.SuiteRunner.runTest(SuiteRunner.java:334)
at org.testng.SuiteRunner.access$000(SuiteRunner.java:37)
at org.testng.SuiteRunner$SuiteWorker.run(SuiteRunner.java:368)
at org.testng.internal.thread.ThreadUtil$2.call(ThreadUtil.java:64)
at java.util.concurrent.FutureTask$Sync.innerRun(FutureTask.java:303)
at java.util.concurrent.FutureTask.run(FutureTask.java:138)
at java.util.concurrent.ThreadPoolExecutor$Worker.runTask(ThreadPoolExecutor.java:886)
at java.util.concurrent.ThreadPoolExecutor$Worker.run(ThreadPoolExecutor.java:908)
at java.lang.Thread.run(Thread.java:680)
testCompareSizes(org.jclouds.openhosting.compute.OpenHostingEast1TemplateBuilderLiveTest) Time elapsed: 0.041 sec <<< FAILURE!
java.lang.ClassCastException: org.jclouds.elasticstack.domain.DriveInfo cannot be cast to java.lang.Comparable
at com.google.common.collect.NaturalOrdering.compare(NaturalOrdering.java:28)
at java.util.Arrays.mergeSort(Arrays.java:1270)
at java.util.Arrays.mergeSort(Arrays.java:1281)
at java.util.Arrays.sort(Arrays.java:1210)
at com.google.common.collect.SortedIterables.sortedUnique(SortedIterables.java:95)
at com.google.common.collect.ImmutableSortedSet.copyOfInternal(ImmutableSortedSet.java:408)
at com.google.common.collect.ImmutableSortedSet.copyOf(ImmutableSortedSet.java:343)
at com.google.common.collect.ImmutableSortedSet.copyOf(ImmutableSortedSet.java:251)
at org.jclouds.util.Iterables2.concreteCopy(Iterables2.java:37)
at org.jclouds.elasticstack.compute.ElasticStackComputeServiceAdapter.listImages(ElasticStackComputeServiceAdapter.java:187)
at org.jclouds.compute.config.ComputeServiceAdapterContextModule$2.get(ComputeServiceAdapterContextModule.java:116)
at org.jclouds.compute.config.ComputeServiceAdapterContextModule$2.get(ComputeServiceAdapterContextModule.java:112)
at org.jclouds.collect.TransformingSetSupplier.get(TransformingSetSupplier.java:47)
at org.jclouds.collect.TransformingSetSupplier.get(TransformingSetSupplier.java:36)
at org.jclouds.compute.config.BaseComputeServiceContextModule$9.get(BaseComputeServiceContextModule.java:247)
at org.jclouds.compute.config.BaseComputeServiceContextModule$9.get(BaseComputeServiceContextModule.java:244)
at org.jclouds.rest.suppliers.SetAndThrowAuthorizationExceptionSupplier.get(SetAndThrowAuthorizationExceptionSupplier.java:49)
at org.jclouds.concurrent.RetryOnTimeOutExceptionSupplier.get(RetryOnTimeOutExceptionSupplier.java:47)
at org.jclouds.util.Suppliers2$ExpiringMemoizingSupplier.get(Suppliers2.java:130)
at org.jclouds.rest.suppliers.MemoizedRetryOnTimeOutButNotOnAuthorizationExceptionSupplier.get(MemoizedRetryOnTimeOutButNotOnAuthorizationExceptionSupplier.java:64)
at org.jclouds.compute.domain.internal.TemplateBuilderImpl.getImages(TemplateBuilderImpl.java:737)
at org.jclouds.compute.domain.internal.TemplateBuilderImpl.build(TemplateBuilderImpl.java:612)
at org.jclouds.compute.domain.internal.TemplateBuilderImpl.build(TemplateBuilderImpl.java:606)
at org.jclouds.compute.internal.BaseTemplateBuilderLiveTest.testCompareSizes(BaseTemplateBuilderLiveTest.java:69)
at sun.reflect.NativeMethodAccessorImpl.invoke0(Native Method)
at sun.reflect.NativeMethodAccessorImpl.invoke(NativeMethodAccessorImpl.java:39)
at sun.reflect.DelegatingMethodAccessorImpl.invoke(DelegatingMethodAccessorImpl.java:25)
at java.lang.reflect.Method.invoke(Method.java:597)
at org.testng.internal.MethodInvocationHelper.invokeMethod(MethodInvocationHelper.java:80)
at org.testng.internal.Invoker.invokeMethod(Invoker.java:701)
at org.testng.internal.Invoker.invokeTestMethod(Invoker.java:893)
at org.testng.internal.Invoker.invokeTestMethods(Invoker.java:1218)
at org.testng.internal.TestMethodWorker.invokeTestMethods(TestMethodWorker.java:127)
at org.testng.internal.TestMethodWorker.run(TestMethodWorker.java:111)
at org.testng.TestRunner.privateRun(TestRunner.java:758)
at org.testng.TestRunner.run(TestRunner.java:613)
at org.testng.SuiteRunner.runTest(SuiteRunner.java:334)
at org.testng.SuiteRunner.access$000(SuiteRunner.java:37)
at org.testng.SuiteRunner$SuiteWorker.run(SuiteRunner.java:368)
at org.testng.internal.thread.ThreadUtil$2.call(ThreadUtil.java:64)
at java.util.concurrent.FutureTask$Sync.innerRun(FutureTask.java:303)
at java.util.concurrent.FutureTask.run(FutureTask.java:138)
at java.util.concurrent.ThreadPoolExecutor$Worker.runTask(ThreadPoolExecutor.java:886)
at java.util.concurrent.ThreadPoolExecutor$Worker.run(ThreadPoolExecutor.java:908)
at java.lang.Thread.run(Thread.java:680)
testFromTemplate(org.jclouds.openhosting.compute.OpenHostingEast1TemplateBuilderLiveTest) Time elapsed: 0.009 sec <<< FAILURE!
java.lang.ClassCastException: org.jclouds.elasticstack.domain.DriveInfo cannot be cast to java.lang.Comparable
at com.google.common.collect.NaturalOrdering.compare(NaturalOrdering.java:28)
at java.util.Arrays.mergeSort(Arrays.java:1270)
at java.util.Arrays.mergeSort(Arrays.java:1281)
at java.util.Arrays.sort(Arrays.java:1210)
at com.google.common.collect.SortedIterables.sortedUnique(SortedIterables.java:95)
at com.google.common.collect.ImmutableSortedSet.copyOfInternal(ImmutableSortedSet.java:408)
at com.google.common.collect.ImmutableSortedSet.copyOf(ImmutableSortedSet.java:343)
at com.google.common.collect.ImmutableSortedSet.copyOf(ImmutableSortedSet.java:251)
at org.jclouds.util.Iterables2.concreteCopy(Iterables2.java:37)
at org.jclouds.elasticstack.compute.ElasticStackComputeServiceAdapter.listImages(ElasticStackComputeServiceAdapter.java:187)
at org.jclouds.compute.config.ComputeServiceAdapterContextModule$2.get(ComputeServiceAdapterContextModule.java:116)
at org.jclouds.compute.config.ComputeServiceAdapterContextModule$2.get(ComputeServiceAdapterContextModule.java:112)
at org.jclouds.collect.TransformingSetSupplier.get(TransformingSetSupplier.java:47)
at org.jclouds.collect.TransformingSetSupplier.get(TransformingSetSupplier.java:36)
at org.jclouds.compute.config.BaseComputeServiceContextModule$9.get(BaseComputeServiceContextModule.java:247)
at org.jclouds.compute.config.BaseComputeServiceContextModule$9.get(BaseComputeServiceContextModule.java:244)
at org.jclouds.rest.suppliers.SetAndThrowAuthorizationExceptionSupplier.get(SetAndThrowAuthorizationExceptionSupplier.java:49)
at org.jclouds.concurrent.RetryOnTimeOutExceptionSupplier.get(RetryOnTimeOutExceptionSupplier.java:47)
at org.jclouds.util.Suppliers2$ExpiringMemoizingSupplier.get(Suppliers2.java:130)
at org.jclouds.rest.suppliers.MemoizedRetryOnTimeOutButNotOnAuthorizationExceptionSupplier.get(MemoizedRetryOnTimeOutButNotOnAuthorizationExceptionSupplier.java:64)
at org.jclouds.compute.domain.internal.TemplateBuilderImpl.getImages(TemplateBuilderImpl.java:737)
at org.jclouds.compute.domain.internal.TemplateBuilderImpl.build(TemplateBuilderImpl.java:612)
at org.jclouds.compute.domain.internal.TemplateBuilderImpl.build(TemplateBuilderImpl.java:606)
at org.jclouds.compute.internal.BaseTemplateBuilderLiveTest.testFromTemplate(BaseTemplateBuilderLiveTest.java:92)
at sun.reflect.NativeMethodAccessorImpl.invoke0(Native Method)
at sun.reflect.NativeMethodAccessorImpl.invoke(NativeMethodAccessorImpl.java:39)
at sun.reflect.DelegatingMethodAccessorImpl.invoke(DelegatingMethodAccessorImpl.java:25)
at java.lang.reflect.Method.invoke(Method.java:597)
at org.testng.internal.MethodInvocationHelper.invokeMethod(MethodInvocationHelper.java:80)
at org.testng.internal.Invoker.invokeMethod(Invoker.java:701)
at org.testng.internal.Invoker.invokeTestMethod(Invoker.java:893)
at org.testng.internal.Invoker.invokeTestMethods(Invoker.java:1218)
at org.testng.internal.TestMethodWorker.invokeTestMethods(TestMethodWorker.java:127)
at org.testng.internal.TestMethodWorker.run(TestMethodWorker.java:111)
at org.testng.TestRunner.privateRun(TestRunner.java:758)
at org.testng.TestRunner.run(TestRunner.java:613)
at org.testng.SuiteRunner.runTest(SuiteRunner.java:334)
at org.testng.SuiteRunner.access$000(SuiteRunner.java:37)
at org.testng.SuiteRunner$SuiteWorker.run(SuiteRunner.java:368)
at org.testng.internal.thread.ThreadUtil$2.call(ThreadUtil.java:64)
at java.util.concurrent.FutureTask$Sync.innerRun(FutureTask.java:303)
at java.util.concurrent.FutureTask.run(FutureTask.java:138)
at java.util.concurrent.ThreadPoolExecutor$Worker.runTask(ThreadPoolExecutor.java:886)
at java.util.concurrent.ThreadPoolExecutor$Worker.run(ThreadPoolExecutor.java:908)
at java.lang.Thread.run(Thread.java:680)
testTemplateBuilderCanFind(org.jclouds.openhosting.compute.OpenHostingEast1TemplateBuilderLiveTest) Time elapsed: 0.005 sec <<< FAILURE!
java.lang.ClassCastException: org.jclouds.elasticstack.domain.DriveInfo cannot be cast to java.lang.Comparable
at com.google.common.collect.NaturalOrdering.compare(NaturalOrdering.java:28)
at java.util.Arrays.mergeSort(Arrays.java:1270)
at java.util.Arrays.mergeSort(Arrays.java:1281)
at java.util.Arrays.sort(Arrays.java:1210)
at com.google.common.collect.SortedIterables.sortedUnique(SortedIterables.java:95)
at com.google.common.collect.ImmutableSortedSet.copyOfInternal(ImmutableSortedSet.java:408)
at com.google.common.collect.ImmutableSortedSet.copyOf(ImmutableSortedSet.java:343)
at com.google.common.collect.ImmutableSortedSet.copyOf(ImmutableSortedSet.java:251)
at org.jclouds.util.Iterables2.concreteCopy(Iterables2.java:37)
at org.jclouds.elasticstack.compute.ElasticStackComputeServiceAdapter.listImages(ElasticStackComputeServiceAdapter.java:187)
at org.jclouds.compute.config.ComputeServiceAdapterContextModule$2.get(ComputeServiceAdapterContextModule.java:116)
at org.jclouds.compute.config.ComputeServiceAdapterContextModule$2.get(ComputeServiceAdapterContextModule.java:112)
at org.jclouds.collect.TransformingSetSupplier.get(TransformingSetSupplier.java:47)
at org.jclouds.collect.TransformingSetSupplier.get(TransformingSetSupplier.java:36)
at org.jclouds.compute.config.BaseComputeServiceContextModule$9.get(BaseComputeServiceContextModule.java:247)
at org.jclouds.compute.config.BaseComputeServiceContextModule$9.get(BaseComputeServiceContextModule.java:244)
at org.jclouds.rest.suppliers.SetAndThrowAuthorizationExceptionSupplier.get(SetAndThrowAuthorizationExceptionSupplier.java:49)
at org.jclouds.concurrent.RetryOnTimeOutExceptionSupplier.get(RetryOnTimeOutExceptionSupplier.java:47)
at org.jclouds.util.Suppliers2$ExpiringMemoizingSupplier.get(Suppliers2.java:130)
at org.jclouds.rest.suppliers.MemoizedRetryOnTimeOutButNotOnAuthorizationExceptionSupplier.get(MemoizedRetryOnTimeOutButNotOnAuthorizationExceptionSupplier.java:64)
at org.jclouds.compute.domain.internal.TemplateBuilderImpl.getImages(TemplateBuilderImpl.java:737)
at org.jclouds.compute.domain.internal.TemplateBuilderImpl.build(TemplateBuilderImpl.java:612)
at org.jclouds.compute.internal.BaseTemplateBuilderLiveTest.testTemplateBuilderCanFind(BaseTemplateBuilderLiveTest.java:141)
at sun.reflect.NativeMethodAccessorImpl.invoke0(Native Method)
at sun.reflect.NativeMethodAccessorImpl.invoke(NativeMethodAccessorImpl.java:39)
at sun.reflect.DelegatingMethodAccessorImpl.invoke(DelegatingMethodAccessorImpl.java:25)
at java.lang.reflect.Method.invoke(Method.java:597)
at org.testng.internal.MethodInvocationHelper.invokeMethod(MethodInvocationHelper.java:80)
at org.testng.internal.Invoker.invokeMethod(Invoker.java:701)
at org.testng.internal.Invoker.invokeTestMethod(Invoker.java:893)
at org.testng.internal.Invoker.invokeTestMethods(Invoker.java:1218)
at org.testng.internal.TestMethodWorker.invokeTestMethods(TestMethodWorker.java:127)
at org.testng.internal.TestMethodWorker.run(TestMethodWorker.java:111)
at org.testng.TestRunner.privateRun(TestRunner.java:758)
at org.testng.TestRunner.run(TestRunner.java:613)
at org.testng.SuiteRunner.runTest(SuiteRunner.java:334)
at org.testng.SuiteRunner.access$000(SuiteRunner.java:37)
at org.testng.SuiteRunner$SuiteWorker.run(SuiteRunner.java:368)
at org.testng.internal.thread.ThreadUtil$2.call(ThreadUtil.java:64)
at java.util.concurrent.FutureTask$Sync.innerRun(FutureTask.java:303)
at java.util.concurrent.FutureTask.run(FutureTask.java:138)
at java.util.concurrent.ThreadPoolExecutor$Worker.runTask(ThreadPoolExecutor.java:886)
at java.util.concurrent.ThreadPoolExecutor$Worker.run(ThreadPoolExecutor.java:908)
at java.lang.Thread.run(Thread.java:680)
testTemplateBuilderCanFind(org.jclouds.openhosting.compute.OpenHostingEast1TemplateBuilderLiveTest) Time elapsed: 0.002 sec <<< FAILURE!
java.lang.ClassCastException: org.jclouds.elasticstack.domain.DriveInfo cannot be cast to java.lang.Comparable
at com.google.common.collect.NaturalOrdering.compare(NaturalOrdering.java:28)
at java.util.Arrays.mergeSort(Arrays.java:1270)
at java.util.Arrays.mergeSort(Arrays.java:1281)
at java.util.Arrays.sort(Arrays.java:1210)
at com.google.common.collect.SortedIterables.sortedUnique(SortedIterables.java:95)
at com.google.common.collect.ImmutableSortedSet.copyOfInternal(ImmutableSortedSet.java:408)
at com.google.common.collect.ImmutableSortedSet.copyOf(ImmutableSortedSet.java:343)
at com.google.common.collect.ImmutableSortedSet.copyOf(ImmutableSortedSet.java:251)
at org.jclouds.util.Iterables2.concreteCopy(Iterables2.java:37)
at org.jclouds.elasticstack.compute.ElasticStackComputeServiceAdapter.listImages(ElasticStackComputeServiceAdapter.java:187)
at org.jclouds.compute.config.ComputeServiceAdapterContextModule$2.get(ComputeServiceAdapterContextModule.java:116)
at org.jclouds.compute.config.ComputeServiceAdapterContextModule$2.get(ComputeServiceAdapterContextModule.java:112)
at org.jclouds.collect.TransformingSetSupplier.get(TransformingSetSupplier.java:47)
at org.jclouds.collect.TransformingSetSupplier.get(TransformingSetSupplier.java:36)
at org.jclouds.compute.config.BaseComputeServiceContextModule$9.get(BaseComputeServiceContextModule.java:247)
at org.jclouds.compute.config.BaseComputeServiceContextModule$9.get(BaseComputeServiceContextModule.java:244)
at org.jclouds.rest.suppliers.SetAndThrowAuthorizationExceptionSupplier.get(SetAndThrowAuthorizationExceptionSupplier.java:49)
at org.jclouds.concurrent.RetryOnTimeOutExceptionSupplier.get(RetryOnTimeOutExceptionSupplier.java:47)
at org.jclouds.util.Suppliers2$ExpiringMemoizingSupplier.get(Suppliers2.java:130)
at org.jclouds.rest.suppliers.MemoizedRetryOnTimeOutButNotOnAuthorizationExceptionSupplier.get(MemoizedRetryOnTimeOutButNotOnAuthorizationExceptionSupplier.java:64)
at org.jclouds.compute.domain.internal.TemplateBuilderImpl.getImages(TemplateBuilderImpl.java:737)
at org.jclouds.compute.domain.internal.TemplateBuilderImpl.build(TemplateBuilderImpl.java:612)
at org.jclouds.compute.internal.BaseTemplateBuilderLiveTest.testTemplateBuilderCanFind(BaseTemplateBuilderLiveTest.java:141)
at sun.reflect.NativeMethodAccessorImpl.invoke0(Native Method)
at sun.reflect.NativeMethodAccessorImpl.invoke(NativeMethodAccessorImpl.java:39)
at sun.reflect.DelegatingMethodAccessorImpl.invoke(DelegatingMethodAccessorImpl.java:25)
at java.lang.reflect.Method.invoke(Method.java:597)
at org.testng.internal.MethodInvocationHelper.invokeMethod(MethodInvocationHelper.java:80)
at org.testng.internal.Invoker.invokeMethod(Invoker.java:701)
at org.testng.internal.Invoker.invokeTestMethod(Invoker.java:893)
at org.testng.internal.Invoker.invokeTestMethods(Invoker.java:1218)
at org.testng.internal.TestMethodWorker.invokeTestMethods(TestMethodWorker.java:127)
at org.testng.internal.TestMethodWorker.run(TestMethodWorker.java:111)
at org.testng.TestRunner.privateRun(TestRunner.java:758)
at org.testng.TestRunner.run(TestRunner.java:613)
at org.testng.SuiteRunner.runTest(SuiteRunner.java:334)
at org.testng.SuiteRunner.access$000(SuiteRunner.java:37)
at org.testng.SuiteRunner$SuiteWorker.run(SuiteRunner.java:368)
at org.testng.internal.thread.ThreadUtil$2.call(ThreadUtil.java:64)
at java.util.concurrent.FutureTask$Sync.innerRun(FutureTask.java:303)
at java.util.concurrent.FutureTask.run(FutureTask.java:138)
at java.util.concurrent.ThreadPoolExecutor$Worker.runTask(ThreadPoolExecutor.java:886)
at java.util.concurrent.ThreadPoolExecutor$Worker.run(ThreadPoolExecutor.java:908)
at java.lang.Thread.run(Thread.java:680)
testTemplateBuilderCanFind(org.jclouds.openhosting.compute.OpenHostingEast1TemplateBuilderLiveTest) Time elapsed: 0.002 sec <<< FAILURE!
java.lang.ClassCastException: org.jclouds.elasticstack.domain.DriveInfo cannot be cast to java.lang.Comparable
at com.google.common.collect.NaturalOrdering.compare(NaturalOrdering.java:28)
at java.util.Arrays.mergeSort(Arrays.java:1270)
at java.util.Arrays.mergeSort(Arrays.java:1281)
at java.util.Arrays.sort(Arrays.java:1210)
at com.google.common.collect.SortedIterables.sortedUnique(SortedIterables.java:95)
at com.google.common.collect.ImmutableSortedSet.copyOfInternal(ImmutableSortedSet.java:408)
at com.google.common.collect.ImmutableSortedSet.copyOf(ImmutableSortedSet.java:343)
at com.google.common.collect.ImmutableSortedSet.copyOf(ImmutableSortedSet.java:251)
at org.jclouds.util.Iterables2.concreteCopy(Iterables2.java:37)
at org.jclouds.elasticstack.compute.ElasticStackComputeServiceAdapter.listImages(ElasticStackComputeServiceAdapter.java:187)
at org.jclouds.compute.config.ComputeServiceAdapterContextModule$2.get(ComputeServiceAdapterContextModule.java:116)
at org.jclouds.compute.config.ComputeServiceAdapterContextModule$2.get(ComputeServiceAdapterContextModule.java:112)
at org.jclouds.collect.TransformingSetSupplier.get(TransformingSetSupplier.java:47)
at org.jclouds.collect.TransformingSetSupplier.get(TransformingSetSupplier.java:36)
at org.jclouds.compute.config.BaseComputeServiceContextModule$9.get(BaseComputeServiceContextModule.java:247)
at org.jclouds.compute.config.BaseComputeServiceContextModule$9.get(BaseComputeServiceContextModule.java:244)
at org.jclouds.rest.suppliers.SetAndThrowAuthorizationExceptionSupplier.get(SetAndThrowAuthorizationExceptionSupplier.java:49)
at org.jclouds.concurrent.RetryOnTimeOutExceptionSupplier.get(RetryOnTimeOutExceptionSupplier.java:47)
at org.jclouds.util.Suppliers2$ExpiringMemoizingSupplier.get(Suppliers2.java:130)
at org.jclouds.rest.suppliers.MemoizedRetryOnTimeOutButNotOnAuthorizationExceptionSupplier.get(MemoizedRetryOnTimeOutButNotOnAuthorizationExceptionSupplier.java:64)
at org.jclouds.compute.domain.internal.TemplateBuilderImpl.getImages(TemplateBuilderImpl.java:737)
at org.jclouds.compute.domain.internal.TemplateBuilderImpl.build(TemplateBuilderImpl.java:612)
at org.jclouds.compute.internal.BaseTemplateBuilderLiveTest.testTemplateBuilderCanFind(BaseTemplateBuilderLiveTest.java:141)
at sun.reflect.NativeMethodAccessorImpl.invoke0(Native Method)
at sun.reflect.NativeMethodAccessorImpl.invoke(NativeMethodAccessorImpl.java:39)
at sun.reflect.DelegatingMethodAccessorImpl.invoke(DelegatingMethodAccessorImpl.java:25)
at java.lang.reflect.Method.invoke(Method.java:597)
at org.testng.internal.MethodInvocationHelper.invokeMethod(MethodInvocationHelper.java:80)
at org.testng.internal.Invoker.invokeMethod(Invoker.java:701)
at org.testng.internal.Invoker.invokeTestMethod(Invoker.java:893)
at org.testng.internal.Invoker.invokeTestMethods(Invoker.java:1218)
at org.testng.internal.TestMethodWorker.invokeTestMethods(TestMethodWorker.java:127)
at org.testng.internal.TestMethodWorker.run(TestMethodWorker.java:111)
at org.testng.TestRunner.privateRun(TestRunner.java:758)
at org.testng.TestRunner.run(TestRunner.java:613)
at org.testng.SuiteRunner.runTest(SuiteRunner.java:334)
at org.testng.SuiteRunner.access$000(SuiteRunner.java:37)
at org.testng.SuiteRunner$SuiteWorker.run(SuiteRunner.java:368)
at org.testng.internal.thread.ThreadUtil$2.call(ThreadUtil.java:64)
at java.util.concurrent.FutureTask$Sync.innerRun(FutureTask.java:303)
at java.util.concurrent.FutureTask.run(FutureTask.java:138)
at java.util.concurrent.ThreadPoolExecutor$Worker.runTask(ThreadPoolExecutor.java:886)
at java.util.concurrent.ThreadPoolExecutor$Worker.run(ThreadPoolExecutor.java:908)
at java.lang.Thread.run(Thread.java:680)
testTemplateBuilderCanFind(org.jclouds.openhosting.compute.OpenHostingEast1TemplateBuilderLiveTest) Time elapsed: 0.002 sec <<< FAILURE!
java.lang.ClassCastException: org.jclouds.elasticstack.domain.DriveInfo cannot be cast to java.lang.Comparable
at com.google.common.collect.NaturalOrdering.compare(NaturalOrdering.java:28)
at java.util.Arrays.mergeSort(Arrays.java:1270)
at java.util.Arrays.mergeSort(Arrays.java:1281)
at java.util.Arrays.sort(Arrays.java:1210)
at com.google.common.collect.SortedIterables.sortedUnique(SortedIterables.java:95)
at com.google.common.collect.ImmutableSortedSet.copyOfInternal(ImmutableSortedSet.java:408)
at com.google.common.collect.ImmutableSortedSet.copyOf(ImmutableSortedSet.java:343)
at com.google.common.collect.ImmutableSortedSet.copyOf(ImmutableSortedSet.java:251)
at org.jclouds.util.Iterables2.concreteCopy(Iterables2.java:37)
at org.jclouds.elasticstack.compute.ElasticStackComputeServiceAdapter.listImages(ElasticStackComputeServiceAdapter.java:187)
at org.jclouds.compute.config.ComputeServiceAdapterContextModule$2.get(ComputeServiceAdapterContextModule.java:116)
at org.jclouds.compute.config.ComputeServiceAdapterContextModule$2.get(ComputeServiceAdapterContextModule.java:112)
at org.jclouds.collect.TransformingSetSupplier.get(TransformingSetSupplier.java:47)
at org.jclouds.collect.TransformingSetSupplier.get(TransformingSetSupplier.java:36)
at org.jclouds.compute.config.BaseComputeServiceContextModule$9.get(BaseComputeServiceContextModule.java:247)
at org.jclouds.compute.config.BaseComputeServiceContextModule$9.get(BaseComputeServiceContextModule.java:244)
at org.jclouds.rest.suppliers.SetAndThrowAuthorizationExceptionSupplier.get(SetAndThrowAuthorizationExceptionSupplier.java:49)
at org.jclouds.concurrent.RetryOnTimeOutExceptionSupplier.get(RetryOnTimeOutExceptionSupplier.java:47)
at org.jclouds.util.Suppliers2$ExpiringMemoizingSupplier.get(Suppliers2.java:130)
at org.jclouds.rest.suppliers.MemoizedRetryOnTimeOutButNotOnAuthorizationExceptionSupplier.get(MemoizedRetryOnTimeOutButNotOnAuthorizationExceptionSupplier.java:64)
at org.jclouds.compute.domain.internal.TemplateBuilderImpl.getImages(TemplateBuilderImpl.java:737)
at org.jclouds.compute.domain.internal.TemplateBuilderImpl.build(TemplateBuilderImpl.java:612)
at org.jclouds.compute.internal.BaseTemplateBuilderLiveTest.testTemplateBuilderCanFind(BaseTemplateBuilderLiveTest.java:141)
at sun.reflect.NativeMethodAccessorImpl.invoke0(Native Method)
at sun.reflect.NativeMethodAccessorImpl.invoke(NativeMethodAccessorImpl.java:39)
at sun.reflect.DelegatingMethodAccessorImpl.invoke(DelegatingMethodAccessorImpl.java:25)
at java.lang.reflect.Method.invoke(Method.java:597)
at org.testng.internal.MethodInvocationHelper.invokeMethod(MethodInvocationHelper.java:80)
at org.testng.internal.Invoker.invokeMethod(Invoker.java:701)
at org.testng.internal.Invoker.invokeTestMethod(Invoker.java:893)
at org.testng.internal.Invoker.invokeTestMethods(Invoker.java:1218)
at org.testng.internal.TestMethodWorker.invokeTestMethods(TestMethodWorker.java:127)
at org.testng.internal.TestMethodWorker.run(TestMethodWorker.java:111)
at org.testng.TestRunner.privateRun(TestRunner.java:758)
at org.testng.TestRunner.run(TestRunner.java:613)
at org.testng.SuiteRunner.runTest(SuiteRunner.java:334)
at org.testng.SuiteRunner.access$000(SuiteRunner.java:37)
at org.testng.SuiteRunner$SuiteWorker.run(SuiteRunner.java:368)
at org.testng.internal.thread.ThreadUtil$2.call(ThreadUtil.java:64)
at java.util.concurrent.FutureTask$Sync.innerRun(FutureTask.java:303)
at java.util.concurrent.FutureTask.run(FutureTask.java:138)
at java.util.concurrent.ThreadPoolExecutor$Worker.runTask(ThreadPoolExecutor.java:886)
at java.util.concurrent.ThreadPoolExecutor$Worker.run(ThreadPoolExecutor.java:908)
at java.lang.Thread.run(Thread.java:680)
testTemplateBuilderCanFind(org.jclouds.openhosting.compute.OpenHostingEast1TemplateBuilderLiveTest) Time elapsed: 0.002 sec <<< FAILURE!
java.lang.ClassCastException: org.jclouds.elasticstack.domain.DriveInfo cannot be cast to java.lang.Comparable
at com.google.common.collect.NaturalOrdering.compare(NaturalOrdering.java:28)
at java.util.Arrays.mergeSort(Arrays.java:1270)
at java.util.Arrays.mergeSort(Arrays.java:1281)
at java.util.Arrays.sort(Arrays.java:1210)
at com.google.common.collect.SortedIterables.sortedUnique(SortedIterables.java:95)
at com.google.common.collect.ImmutableSortedSet.copyOfInternal(ImmutableSortedSet.java:408)
at com.google.common.collect.ImmutableSortedSet.copyOf(ImmutableSortedSet.java:343)
at com.google.common.collect.ImmutableSortedSet.copyOf(ImmutableSortedSet.java:251)
at org.jclouds.util.Iterables2.concreteCopy(Iterables2.java:37)
at org.jclouds.elasticstack.compute.ElasticStackComputeServiceAdapter.listImages(ElasticStackComputeServiceAdapter.java:187)
at org.jclouds.compute.config.ComputeServiceAdapterContextModule$2.get(ComputeServiceAdapterContextModule.java:116)
at org.jclouds.compute.config.ComputeServiceAdapterContextModule$2.get(ComputeServiceAdapterContextModule.java:112)
at org.jclouds.collect.TransformingSetSupplier.get(TransformingSetSupplier.java:47)
at org.jclouds.collect.TransformingSetSupplier.get(TransformingSetSupplier.java:36)
at org.jclouds.compute.config.BaseComputeServiceContextModule$9.get(BaseComputeServiceContextModule.java:247)
at org.jclouds.compute.config.BaseComputeServiceContextModule$9.get(BaseComputeServiceContextModule.java:244)
at org.jclouds.rest.suppliers.SetAndThrowAuthorizationExceptionSupplier.get(SetAndThrowAuthorizationExceptionSupplier.java:49)
at org.jclouds.concurrent.RetryOnTimeOutExceptionSupplier.get(RetryOnTimeOutExceptionSupplier.java:47)
at org.jclouds.util.Suppliers2$ExpiringMemoizingSupplier.get(Suppliers2.java:130)
at org.jclouds.rest.suppliers.MemoizedRetryOnTimeOutButNotOnAuthorizationExceptionSupplier.get(MemoizedRetryOnTimeOutButNotOnAuthorizationExceptionSupplier.java:64)
at org.jclouds.compute.domain.internal.TemplateBuilderImpl.getImages(TemplateBuilderImpl.java:737)
at org.jclouds.compute.domain.internal.TemplateBuilderImpl.build(TemplateBuilderImpl.java:612)
at org.jclouds.compute.internal.BaseTemplateBuilderLiveTest.testTemplateBuilderCanFind(BaseTemplateBuilderLiveTest.java:141)
at sun.reflect.NativeMethodAccessorImpl.invoke0(Native Method)
at sun.reflect.NativeMethodAccessorImpl.invoke(NativeMethodAccessorImpl.java:39)
at sun.reflect.DelegatingMethodAccessorImpl.invoke(DelegatingMethodAccessorImpl.java:25)
at java.lang.reflect.Method.invoke(Method.java:597)
at org.testng.internal.MethodInvocationHelper.invokeMethod(MethodInvocationHelper.java:80)
at org.testng.internal.Invoker.invokeMethod(Invoker.java:701)
at org.testng.internal.Invoker.invokeTestMethod(Invoker.java:893)
at org.testng.internal.Invoker.invokeTestMethods(Invoker.java:1218)
at org.testng.internal.TestMethodWorker.invokeTestMethods(TestMethodWorker.java:127)
at org.testng.internal.TestMethodWorker.run(TestMethodWorker.java:111)
at org.testng.TestRunner.privateRun(TestRunner.java:758)
at org.testng.TestRunner.run(TestRunner.java:613)
at org.testng.SuiteRunner.runTest(SuiteRunner.java:334)
at org.testng.SuiteRunner.access$000(SuiteRunner.java:37)
at org.testng.SuiteRunner$SuiteWorker.run(SuiteRunner.java:368)
at org.testng.internal.thread.ThreadUtil$2.call(ThreadUtil.java:64)
at java.util.concurrent.FutureTask$Sync.innerRun(FutureTask.java:303)
at java.util.concurrent.FutureTask.run(FutureTask.java:138)
at java.util.concurrent.ThreadPoolExecutor$Worker.runTask(ThreadPoolExecutor.java:886)
at java.util.concurrent.ThreadPoolExecutor$Worker.run(ThreadPoolExecutor.java:908)
at java.lang.Thread.run(Thread.java:680)
testTemplateBuilderCanFind(org.jclouds.openhosting.compute.OpenHostingEast1TemplateBuilderLiveTest) Time elapsed: 0.002 sec <<< FAILURE!
java.lang.ClassCastException: org.jclouds.elasticstack.domain.DriveInfo cannot be cast to java.lang.Comparable
at com.google.common.collect.NaturalOrdering.compare(NaturalOrdering.java:28)
at java.util.Arrays.mergeSort(Arrays.java:1270)
at java.util.Arrays.mergeSort(Arrays.java:1281)
at java.util.Arrays.sort(Arrays.java:1210)
at com.google.common.collect.SortedIterables.sortedUnique(SortedIterables.java:95)
at com.google.common.collect.ImmutableSortedSet.copyOfInternal(ImmutableSortedSet.java:408)
at com.google.common.collect.ImmutableSortedSet.copyOf(ImmutableSortedSet.java:343)
at com.google.common.collect.ImmutableSortedSet.copyOf(ImmutableSortedSet.java:251)
at org.jclouds.util.Iterables2.concreteCopy(Iterables2.java:37)
at org.jclouds.elasticstack.compute.ElasticStackComputeServiceAdapter.listImages(ElasticStackComputeServiceAdapter.java:187)
at org.jclouds.compute.config.ComputeServiceAdapterContextModule$2.get(ComputeServiceAdapterContextModule.java:116)
at org.jclouds.compute.config.ComputeServiceAdapterContextModule$2.get(ComputeServiceAdapterContextModule.java:112)
at org.jclouds.collect.TransformingSetSupplier.get(TransformingSetSupplier.java:47)
at org.jclouds.collect.TransformingSetSupplier.get(TransformingSetSupplier.java:36)
at org.jclouds.compute.config.BaseComputeServiceContextModule$9.get(BaseComputeServiceContextModule.java:247)
at org.jclouds.compute.config.BaseComputeServiceContextModule$9.get(BaseComputeServiceContextModule.java:244)
at org.jclouds.rest.suppliers.SetAndThrowAuthorizationExceptionSupplier.get(SetAndThrowAuthorizationExceptionSupplier.java:49)
at org.jclouds.concurrent.RetryOnTimeOutExceptionSupplier.get(RetryOnTimeOutExceptionSupplier.java:47)
at org.jclouds.util.Suppliers2$ExpiringMemoizingSupplier.get(Suppliers2.java:130)
at org.jclouds.rest.suppliers.MemoizedRetryOnTimeOutButNotOnAuthorizationExceptionSupplier.get(MemoizedRetryOnTimeOutButNotOnAuthorizationExceptionSupplier.java:64)
at org.jclouds.compute.domain.internal.TemplateBuilderImpl.getImages(TemplateBuilderImpl.java:737)
at org.jclouds.compute.domain.internal.TemplateBuilderImpl.build(TemplateBuilderImpl.java:612)
at org.jclouds.compute.internal.BaseTemplateBuilderLiveTest.testTemplateBuilderCanFind(BaseTemplateBuilderLiveTest.java:141)
at sun.reflect.NativeMethodAccessorImpl.invoke0(Native Method)
at sun.reflect.NativeMethodAccessorImpl.invoke(NativeMethodAccessorImpl.java:39)
at sun.reflect.DelegatingMethodAccessorImpl.invoke(DelegatingMethodAccessorImpl.java:25)
at java.lang.reflect.Method.invoke(Method.java:597)
at org.testng.internal.MethodInvocationHelper.invokeMethod(MethodInvocationHelper.java:80)
at org.testng.internal.Invoker.invokeMethod(Invoker.java:701)
at org.testng.internal.Invoker.invokeTestMethod(Invoker.java:893)
at org.testng.internal.Invoker.invokeTestMethods(Invoker.java:1218)
at org.testng.internal.TestMethodWorker.invokeTestMethods(TestMethodWorker.java:127)
at org.testng.internal.TestMethodWorker.run(TestMethodWorker.java:111)
at org.testng.TestRunner.privateRun(TestRunner.java:758)
at org.testng.TestRunner.run(TestRunner.java:613)
at org.testng.SuiteRunner.runTest(SuiteRunner.java:334)
at org.testng.SuiteRunner.access$000(SuiteRunner.java:37)
at org.testng.SuiteRunner$SuiteWorker.run(SuiteRunner.java:368)
at org.testng.internal.thread.ThreadUtil$2.call(ThreadUtil.java:64)
at java.util.concurrent.FutureTask$Sync.innerRun(FutureTask.java:303)
at java.util.concurrent.FutureTask.run(FutureTask.java:138)
at java.util.concurrent.ThreadPoolExecutor$Worker.runTask(ThreadPoolExecutor.java:886)
at java.util.concurrent.ThreadPoolExecutor$Worker.run(ThreadPoolExecutor.java:908)
at java.lang.Thread.run(Thread.java:680)
testTemplateBuilderCanFind(org.jclouds.openhosting.compute.OpenHostingEast1TemplateBuilderLiveTest) Time elapsed: 0.025 sec <<< FAILURE!
java.lang.ClassCastException: org.jclouds.elasticstack.domain.DriveInfo cannot be cast to java.lang.Comparable
at com.google.common.collect.NaturalOrdering.compare(NaturalOrdering.java:28)
at java.util.Arrays.mergeSort(Arrays.java:1270)
at java.util.Arrays.mergeSort(Arrays.java:1281)
at java.util.Arrays.sort(Arrays.java:1210)
at com.google.common.collect.SortedIterables.sortedUnique(SortedIterables.java:95)
at com.google.common.collect.ImmutableSortedSet.copyOfInternal(ImmutableSortedSet.java:408)
at com.google.common.collect.ImmutableSortedSet.copyOf(ImmutableSortedSet.java:343)
at com.google.common.collect.ImmutableSortedSet.copyOf(ImmutableSortedSet.java:251)
at org.jclouds.util.Iterables2.concreteCopy(Iterables2.java:37)
at org.jclouds.elasticstack.compute.ElasticStackComputeServiceAdapter.listImages(ElasticStackComputeServiceAdapter.java:187)
at org.jclouds.compute.config.ComputeServiceAdapterContextModule$2.get(ComputeServiceAdapterContextModule.java:116)
at org.jclouds.compute.config.ComputeServiceAdapterContextModule$2.get(ComputeServiceAdapterContextModule.java:112)
at org.jclouds.collect.TransformingSetSupplier.get(TransformingSetSupplier.java:47)
at org.jclouds.collect.TransformingSetSupplier.get(TransformingSetSupplier.java:36)
at org.jclouds.compute.config.BaseComputeServiceContextModule$9.get(BaseComputeServiceContextModule.java:247)
at org.jclouds.compute.config.BaseComputeServiceContextModule$9.get(BaseComputeServiceContextModule.java:244)
at org.jclouds.rest.suppliers.SetAndThrowAuthorizationExceptionSupplier.get(SetAndThrowAuthorizationExceptionSupplier.java:49)
at org.jclouds.concurrent.RetryOnTimeOutExceptionSupplier.get(RetryOnTimeOutExceptionSupplier.java:47)
at org.jclouds.util.Suppliers2$ExpiringMemoizingSupplier.get(Suppliers2.java:130)
at org.jclouds.rest.suppliers.MemoizedRetryOnTimeOutButNotOnAuthorizationExceptionSupplier.get(MemoizedRetryOnTimeOutButNotOnAuthorizationExceptionSupplier.java:64)
at org.jclouds.compute.domain.internal.TemplateBuilderImpl.getImages(TemplateBuilderImpl.java:737)
at org.jclouds.compute.domain.internal.TemplateBuilderImpl.build(TemplateBuilderImpl.java:612)
at org.jclouds.compute.internal.BaseTemplateBuilderLiveTest.testTemplateBuilderCanFind(BaseTemplateBuilderLiveTest.java:141)
at sun.reflect.NativeMethodAccessorImpl.invoke0(Native Method)
at sun.reflect.NativeMethodAccessorImpl.invoke(NativeMethodAccessorImpl.java:39)
at sun.reflect.DelegatingMethodAccessorImpl.invoke(DelegatingMethodAccessorImpl.java:25)
at java.lang.reflect.Method.invoke(Method.java:597)
at org.testng.internal.MethodInvocationHelper.invokeMethod(MethodInvocationHelper.java:80)
at org.testng.internal.Invoker.invokeMethod(Invoker.java:701)
at org.testng.internal.Invoker.invokeTestMethod(Invoker.java:893)
at org.testng.internal.Invoker.invokeTestMethods(Invoker.java:1218)
at org.testng.internal.TestMethodWorker.invokeTestMethods(TestMethodWorker.java:127)
at org.testng.internal.TestMethodWorker.run(TestMethodWorker.java:111)
at org.testng.TestRunner.privateRun(TestRunner.java:758)
at org.testng.TestRunner.run(TestRunner.java:613)
at org.testng.SuiteRunner.runTest(SuiteRunner.java:334)
at org.testng.SuiteRunner.access$000(SuiteRunner.java:37)
at org.testng.SuiteRunner$SuiteWorker.run(SuiteRunner.java:368)
at org.testng.internal.thread.ThreadUtil$2.call(ThreadUtil.java:64)
at java.util.concurrent.FutureTask$Sync.innerRun(FutureTask.java:303)
at java.util.concurrent.FutureTask.run(FutureTask.java:138)
at java.util.concurrent.ThreadPoolExecutor$Worker.runTask(ThreadPoolExecutor.java:886)
at java.util.concurrent.ThreadPoolExecutor$Worker.run(ThreadPoolExecutor.java:908)
at java.lang.Thread.run(Thread.java:680)
testTemplateBuilderCanFind(org.jclouds.openhosting.compute.OpenHostingEast1TemplateBuilderLiveTest) Time elapsed: 0.026 sec <<< FAILURE!
java.lang.ClassCastException: org.jclouds.elasticstack.domain.DriveInfo cannot be cast to java.lang.Comparable
at com.google.common.collect.NaturalOrdering.compare(NaturalOrdering.java:28)
at java.util.Arrays.mergeSort(Arrays.java:1270)
at java.util.Arrays.mergeSort(Arrays.java:1281)
at java.util.Arrays.sort(Arrays.java:1210)
at com.google.common.collect.SortedIterables.sortedUnique(SortedIterables.java:95)
at com.google.common.collect.ImmutableSortedSet.copyOfInternal(ImmutableSortedSet.java:408)
at com.google.common.collect.ImmutableSortedSet.copyOf(ImmutableSortedSet.java:343)
at com.google.common.collect.ImmutableSortedSet.copyOf(ImmutableSortedSet.java:251)
at org.jclouds.util.Iterables2.concreteCopy(Iterables2.java:37)
at org.jclouds.elasticstack.compute.ElasticStackComputeServiceAdapter.listImages(ElasticStackComputeServiceAdapter.java:187)
at org.jclouds.compute.config.ComputeServiceAdapterContextModule$2.get(ComputeServiceAdapterContextModule.java:116)
at org.jclouds.compute.config.ComputeServiceAdapterContextModule$2.get(ComputeServiceAdapterContextModule.java:112)
at org.jclouds.collect.TransformingSetSupplier.get(TransformingSetSupplier.java:47)
at org.jclouds.collect.TransformingSetSupplier.get(TransformingSetSupplier.java:36)
at org.jclouds.compute.config.BaseComputeServiceContextModule$9.get(BaseComputeServiceContextModule.java:247)
at org.jclouds.compute.config.BaseComputeServiceContextModule$9.get(BaseComputeServiceContextModule.java:244)
at org.jclouds.rest.suppliers.SetAndThrowAuthorizationExceptionSupplier.get(SetAndThrowAuthorizationExceptionSupplier.java:49)
at org.jclouds.concurrent.RetryOnTimeOutExceptionSupplier.get(RetryOnTimeOutExceptionSupplier.java:47)
at org.jclouds.util.Suppliers2$ExpiringMemoizingSupplier.get(Suppliers2.java:130)
at org.jclouds.rest.suppliers.MemoizedRetryOnTimeOutButNotOnAuthorizationExceptionSupplier.get(MemoizedRetryOnTimeOutButNotOnAuthorizationExceptionSupplier.java:64)
at org.jclouds.compute.domain.internal.TemplateBuilderImpl.getImages(TemplateBuilderImpl.java:737)
at org.jclouds.compute.domain.internal.TemplateBuilderImpl.build(TemplateBuilderImpl.java:612)
at org.jclouds.compute.internal.BaseTemplateBuilderLiveTest.testTemplateBuilderCanFind(BaseTemplateBuilderLiveTest.java:141)
at sun.reflect.NativeMethodAccessorImpl.invoke0(Native Method)
at sun.reflect.NativeMethodAccessorImpl.invoke(NativeMethodAccessorImpl.java:39)
at sun.reflect.DelegatingMethodAccessorImpl.invoke(DelegatingMethodAccessorImpl.java:25)
at java.lang.reflect.Method.invoke(Method.java:597)
at org.testng.internal.MethodInvocationHelper.invokeMethod(MethodInvocationHelper.java:80)
at org.testng.internal.Invoker.invokeMethod(Invoker.java:701)
at org.testng.internal.Invoker.invokeTestMethod(Invoker.java:893)
at org.testng.internal.Invoker.invokeTestMethods(Invoker.java:1218)
at org.testng.internal.TestMethodWorker.invokeTestMethods(TestMethodWorker.java:127)
at org.testng.internal.TestMethodWorker.run(TestMethodWorker.java:111)
at org.testng.TestRunner.privateRun(TestRunner.java:758)
at org.testng.TestRunner.run(TestRunner.java:613)
at org.testng.SuiteRunner.runTest(SuiteRunner.java:334)
at org.testng.SuiteRunner.access$000(SuiteRunner.java:37)
at org.testng.SuiteRunner$SuiteWorker.run(SuiteRunner.java:368)
at org.testng.internal.thread.ThreadUtil$2.call(ThreadUtil.java:64)
at java.util.concurrent.FutureTask$Sync.innerRun(FutureTask.java:303)
at java.util.concurrent.FutureTask.run(FutureTask.java:138)
at java.util.concurrent.ThreadPoolExecutor$Worker.runTask(ThreadPoolExecutor.java:886)
at java.util.concurrent.ThreadPoolExecutor$Worker.run(ThreadPoolExecutor.java:908)
at java.lang.Thread.run(Thread.java:680)
testTemplateBuilderCanFind(org.jclouds.openhosting.compute.OpenHostingEast1TemplateBuilderLiveTest) Time elapsed: 0.001 sec <<< FAILURE!
java.lang.ClassCastException: org.jclouds.elasticstack.domain.DriveInfo cannot be cast to java.lang.Comparable
at com.google.common.collect.NaturalOrdering.compare(NaturalOrdering.java:28)
at java.util.Arrays.mergeSort(Arrays.java:1270)
at java.util.Arrays.mergeSort(Arrays.java:1281)
at java.util.Arrays.sort(Arrays.java:1210)
at com.google.common.collect.SortedIterables.sortedUnique(SortedIterables.java:95)
at com.google.common.collect.ImmutableSortedSet.copyOfInternal(ImmutableSortedSet.java:408)
at com.google.common.collect.ImmutableSortedSet.copyOf(ImmutableSortedSet.java:343)
at com.google.common.collect.ImmutableSortedSet.copyOf(ImmutableSortedSet.java:251)
at org.jclouds.util.Iterables2.concreteCopy(Iterables2.java:37)
at org.jclouds.elasticstack.compute.ElasticStackComputeServiceAdapter.listImages(ElasticStackComputeServiceAdapter.java:187)
at org.jclouds.compute.config.ComputeServiceAdapterContextModule$2.get(ComputeServiceAdapterContextModule.java:116)
at org.jclouds.compute.config.ComputeServiceAdapterContextModule$2.get(ComputeServiceAdapterContextModule.java:112)
at org.jclouds.collect.TransformingSetSupplier.get(TransformingSetSupplier.java:47)
at org.jclouds.collect.TransformingSetSupplier.get(TransformingSetSupplier.java:36)
at org.jclouds.compute.config.BaseComputeServiceContextModule$9.get(BaseComputeServiceContextModule.java:247)
at org.jclouds.compute.config.BaseComputeServiceContextModule$9.get(BaseComputeServiceContextModule.java:244)
at org.jclouds.rest.suppliers.SetAndThrowAuthorizationExceptionSupplier.get(SetAndThrowAuthorizationExceptionSupplier.java:49)
at org.jclouds.concurrent.RetryOnTimeOutExceptionSupplier.get(RetryOnTimeOutExceptionSupplier.java:47)
at org.jclouds.util.Suppliers2$ExpiringMemoizingSupplier.get(Suppliers2.java:130)
at org.jclouds.rest.suppliers.MemoizedRetryOnTimeOutButNotOnAuthorizationExceptionSupplier.get(MemoizedRetryOnTimeOutButNotOnAuthorizationExceptionSupplier.java:64)
at org.jclouds.compute.domain.internal.TemplateBuilderImpl.getImages(TemplateBuilderImpl.java:737)
at org.jclouds.compute.domain.internal.TemplateBuilderImpl.build(TemplateBuilderImpl.java:612)
at org.jclouds.compute.internal.BaseTemplateBuilderLiveTest.testTemplateBuilderCanFind(BaseTemplateBuilderLiveTest.java:141)
at sun.reflect.NativeMethodAccessorImpl.invoke0(Native Method)
at sun.reflect.NativeMethodAccessorImpl.invoke(NativeMethodAccessorImpl.java:39)
at sun.reflect.DelegatingMethodAccessorImpl.invoke(DelegatingMethodAccessorImpl.java:25)
at java.lang.reflect.Method.invoke(Method.java:597)
at org.testng.internal.MethodInvocationHelper.invokeMethod(MethodInvocationHelper.java:80)
at org.testng.internal.Invoker.invokeMethod(Invoker.java:701)
at org.testng.internal.Invoker.invokeTestMethod(Invoker.java:893)
at org.testng.internal.Invoker.invokeTestMethods(Invoker.java:1218)
at org.testng.internal.TestMethodWorker.invokeTestMethods(TestMethodWorker.java:127)
at org.testng.internal.TestMethodWorker.run(TestMethodWorker.java:111)
at org.testng.TestRunner.privateRun(TestRunner.java:758)
at org.testng.TestRunner.run(TestRunner.java:613)
at org.testng.SuiteRunner.runTest(SuiteRunner.java:334)
at org.testng.SuiteRunner.access$000(SuiteRunner.java:37)
at org.testng.SuiteRunner$SuiteWorker.run(SuiteRunner.java:368)
at org.testng.internal.thread.ThreadUtil$2.call(ThreadUtil.java:64)
at java.util.concurrent.FutureTask$Sync.innerRun(FutureTask.java:303)
at java.util.concurrent.FutureTask.run(FutureTask.java:138)
at java.util.concurrent.ThreadPoolExecutor$Worker.runTask(ThreadPoolExecutor.java:886)
at java.util.concurrent.ThreadPoolExecutor$Worker.run(ThreadPoolExecutor.java:908)
at java.lang.Thread.run(Thread.java:680)
testTemplateBuilderCanFind(org.jclouds.openhosting.compute.OpenHostingEast1TemplateBuilderLiveTest) Time elapsed: 0 sec <<< FAILURE!
java.lang.ClassCastException: org.jclouds.elasticstack.domain.DriveInfo cannot be cast to java.lang.Comparable
at com.google.common.collect.NaturalOrdering.compare(NaturalOrdering.java:28)
at java.util.Arrays.mergeSort(Arrays.java:1270)
at java.util.Arrays.mergeSort(Arrays.java:1281)
at java.util.Arrays.sort(Arrays.java:1210)
at com.google.common.collect.SortedIterables.sortedUnique(SortedIterables.java:95)
at com.google.common.collect.ImmutableSortedSet.copyOfInternal(ImmutableSortedSet.java:408)
at com.google.common.collect.ImmutableSortedSet.copyOf(ImmutableSortedSet.java:343)
at com.google.common.collect.ImmutableSortedSet.copyOf(ImmutableSortedSet.java:251)
at org.jclouds.util.Iterables2.concreteCopy(Iterables2.java:37)
at org.jclouds.elasticstack.compute.ElasticStackComputeServiceAdapter.listImages(ElasticStackComputeServiceAdapter.java:187)
at org.jclouds.compute.config.ComputeServiceAdapterContextModule$2.get(ComputeServiceAdapterContextModule.java:116)
at org.jclouds.compute.config.ComputeServiceAdapterContextModule$2.get(ComputeServiceAdapterContextModule.java:112)
at org.jclouds.collect.TransformingSetSupplier.get(TransformingSetSupplier.java:47)
at org.jclouds.collect.TransformingSetSupplier.get(TransformingSetSupplier.java:36)
at org.jclouds.compute.config.BaseComputeServiceContextModule$9.get(BaseComputeServiceContextModule.java:247)
at org.jclouds.compute.config.BaseComputeServiceContextModule$9.get(BaseComputeServiceContextModule.java:244)
at org.jclouds.rest.suppliers.SetAndThrowAuthorizationExceptionSupplier.get(SetAndThrowAuthorizationExceptionSupplier.java:49)
at org.jclouds.concurrent.RetryOnTimeOutExceptionSupplier.get(RetryOnTimeOutExceptionSupplier.java:47)
at org.jclouds.util.Suppliers2$ExpiringMemoizingSupplier.get(Suppliers2.java:130)
at org.jclouds.rest.suppliers.MemoizedRetryOnTimeOutButNotOnAuthorizationExceptionSupplier.get(MemoizedRetryOnTimeOutButNotOnAuthorizationExceptionSupplier.java:64)
at org.jclouds.compute.domain.internal.TemplateBuilderImpl.getImages(TemplateBuilderImpl.java:737)
at org.jclouds.compute.domain.internal.TemplateBuilderImpl.build(TemplateBuilderImpl.java:612)
at org.jclouds.compute.internal.BaseTemplateBuilderLiveTest.testTemplateBuilderCanFind(BaseTemplateBuilderLiveTest.java:141)
at sun.reflect.NativeMethodAccessorImpl.invoke0(Native Method)
at sun.reflect.NativeMethodAccessorImpl.invoke(NativeMethodAccessorImpl.java:39)
at sun.reflect.DelegatingMethodAccessorImpl.invoke(DelegatingMethodAccessorImpl.java:25)
at java.lang.reflect.Method.invoke(Method.java:597)
at org.testng.internal.MethodInvocationHelper.invokeMethod(MethodInvocationHelper.java:80)
at org.testng.internal.Invoker.invokeMethod(Invoker.java:701)
at org.testng.internal.Invoker.invokeTestMethod(Invoker.java:893)
at org.testng.internal.Invoker.invokeTestMethods(Invoker.java:1218)
at org.testng.internal.TestMethodWorker.invokeTestMethods(TestMethodWorker.java:127)
at org.testng.internal.TestMethodWorker.run(TestMethodWorker.java:111)
at org.testng.TestRunner.privateRun(TestRunner.java:758)
at org.testng.TestRunner.run(TestRunner.java:613)
at org.testng.SuiteRunner.runTest(SuiteRunner.java:334)
at org.testng.SuiteRunner.access$000(SuiteRunner.java:37)
at org.testng.SuiteRunner$SuiteWorker.run(SuiteRunner.java:368)
at org.testng.internal.thread.ThreadUtil$2.call(ThreadUtil.java:64)
at java.util.concurrent.FutureTask$Sync.innerRun(FutureTask.java:303)
at java.util.concurrent.FutureTask.run(FutureTask.java:138)
at java.util.concurrent.ThreadPoolExecutor$Worker.runTask(ThreadPoolExecutor.java:886)
at java.util.concurrent.ThreadPoolExecutor$Worker.run(ThreadPoolExecutor.java:908)
at java.lang.Thread.run(Thread.java:680)
testTemplateBuilderCanFind(org.jclouds.openhosting.compute.OpenHostingEast1TemplateBuilderLiveTest) Time elapsed: 0.007 sec <<< FAILURE!
java.lang.ClassCastException: org.jclouds.elasticstack.domain.DriveInfo cannot be cast to java.lang.Comparable
at com.google.common.collect.NaturalOrdering.compare(NaturalOrdering.java:28)
at java.util.Arrays.mergeSort(Arrays.java:1270)
at java.util.Arrays.mergeSort(Arrays.java:1281)
at java.util.Arrays.sort(Arrays.java:1210)
at com.google.common.collect.SortedIterables.sortedUnique(SortedIterables.java:95)
at com.google.common.collect.ImmutableSortedSet.copyOfInternal(ImmutableSortedSet.java:408)
at com.google.common.collect.ImmutableSortedSet.copyOf(ImmutableSortedSet.java:343)
at com.google.common.collect.ImmutableSortedSet.copyOf(ImmutableSortedSet.java:251)
at org.jclouds.util.Iterables2.concreteCopy(Iterables2.java:37)
at org.jclouds.elasticstack.compute.ElasticStackComputeServiceAdapter.listImages(ElasticStackComputeServiceAdapter.java:187)
at org.jclouds.compute.config.ComputeServiceAdapterContextModule$2.get(ComputeServiceAdapterContextModule.java:116)
at org.jclouds.compute.config.ComputeServiceAdapterContextModule$2.get(ComputeServiceAdapterContextModule.java:112)
at org.jclouds.collect.TransformingSetSupplier.get(TransformingSetSupplier.java:47)
at org.jclouds.collect.TransformingSetSupplier.get(TransformingSetSupplier.java:36)
at org.jclouds.compute.config.BaseComputeServiceContextModule$9.get(BaseComputeServiceContextModule.java:247)
at org.jclouds.compute.config.BaseComputeServiceContextModule$9.get(BaseComputeServiceContextModule.java:244)
at org.jclouds.rest.suppliers.SetAndThrowAuthorizationExceptionSupplier.get(SetAndThrowAuthorizationExceptionSupplier.java:49)
at org.jclouds.concurrent.RetryOnTimeOutExceptionSupplier.get(RetryOnTimeOutExceptionSupplier.java:47)
at org.jclouds.util.Suppliers2$ExpiringMemoizingSupplier.get(Suppliers2.java:130)
at org.jclouds.rest.suppliers.MemoizedRetryOnTimeOutButNotOnAuthorizationExceptionSupplier.get(MemoizedRetryOnTimeOutButNotOnAuthorizationExceptionSupplier.java:64)
at org.jclouds.compute.domain.internal.TemplateBuilderImpl.getImages(TemplateBuilderImpl.java:737)
at org.jclouds.compute.domain.internal.TemplateBuilderImpl.build(TemplateBuilderImpl.java:612)
at org.jclouds.compute.internal.BaseTemplateBuilderLiveTest.testTemplateBuilderCanFind(BaseTemplateBuilderLiveTest.java:141)
at sun.reflect.NativeMethodAccessorImpl.invoke0(Native Method)
at sun.reflect.NativeMethodAccessorImpl.invoke(NativeMethodAccessorImpl.java:39)
at sun.reflect.DelegatingMethodAccessorImpl.invoke(DelegatingMethodAccessorImpl.java:25)
at java.lang.reflect.Method.invoke(Method.java:597)
at org.testng.internal.MethodInvocationHelper.invokeMethod(MethodInvocationHelper.java:80)
at org.testng.internal.Invoker.invokeMethod(Invoker.java:701)
at org.testng.internal.Invoker.invokeTestMethod(Invoker.java:893)
at org.testng.internal.Invoker.invokeTestMethods(Invoker.java:1218)
at org.testng.internal.TestMethodWorker.invokeTestMethods(TestMethodWorker.java:127)
at org.testng.internal.TestMethodWorker.run(TestMethodWorker.java:111)
at org.testng.TestRunner.privateRun(TestRunner.java:758)
at org.testng.TestRunner.run(TestRunner.java:613)
at org.testng.SuiteRunner.runTest(SuiteRunner.java:334)
at org.testng.SuiteRunner.access$000(SuiteRunner.java:37)
at org.testng.SuiteRunner$SuiteWorker.run(SuiteRunner.java:368)
at org.testng.internal.thread.ThreadUtil$2.call(ThreadUtil.java:64)
at java.util.concurrent.FutureTask$Sync.innerRun(FutureTask.java:303)
at java.util.concurrent.FutureTask.run(FutureTask.java:138)
at java.util.concurrent.ThreadPoolExecutor$Worker.runTask(ThreadPoolExecutor.java:886)
at java.util.concurrent.ThreadPoolExecutor$Worker.run(ThreadPoolExecutor.java:908)
at java.lang.Thread.run(Thread.java:680)
testTemplateBuilderCanUseImageId(org.jclouds.openhosting.compute.OpenHostingEast1TemplateBuilderLiveTest) Time elapsed: 0.005 sec <<< FAILURE!
java.lang.ClassCastException: org.jclouds.elasticstack.domain.DriveInfo cannot be cast to java.lang.Comparable
at com.google.common.collect.NaturalOrdering.compare(NaturalOrdering.java:28)
at java.util.Arrays.mergeSort(Arrays.java:1270)
at java.util.Arrays.mergeSort(Arrays.java:1281)
at java.util.Arrays.sort(Arrays.java:1210)
at com.google.common.collect.SortedIterables.sortedUnique(SortedIterables.java:95)
at com.google.common.collect.ImmutableSortedSet.copyOfInternal(ImmutableSortedSet.java:408)
at com.google.common.collect.ImmutableSortedSet.copyOf(ImmutableSortedSet.java:343)
at com.google.common.collect.ImmutableSortedSet.copyOf(ImmutableSortedSet.java:251)
at org.jclouds.util.Iterables2.concreteCopy(Iterables2.java:37)
at org.jclouds.elasticstack.compute.ElasticStackComputeServiceAdapter.listImages(ElasticStackComputeServiceAdapter.java:187)
at org.jclouds.compute.config.ComputeServiceAdapterContextModule$2.get(ComputeServiceAdapterContextModule.java:116)
at org.jclouds.compute.config.ComputeServiceAdapterContextModule$2.get(ComputeServiceAdapterContextModule.java:112)
at org.jclouds.collect.TransformingSetSupplier.get(TransformingSetSupplier.java:47)
at org.jclouds.collect.TransformingSetSupplier.get(TransformingSetSupplier.java:36)
at org.jclouds.compute.config.BaseComputeServiceContextModule$9.get(BaseComputeServiceContextModule.java:247)
at org.jclouds.compute.config.BaseComputeServiceContextModule$9.get(BaseComputeServiceContextModule.java:244)
at org.jclouds.rest.suppliers.SetAndThrowAuthorizationExceptionSupplier.get(SetAndThrowAuthorizationExceptionSupplier.java:49)
at org.jclouds.concurrent.RetryOnTimeOutExceptionSupplier.get(RetryOnTimeOutExceptionSupplier.java:47)
at org.jclouds.util.Suppliers2$ExpiringMemoizingSupplier.get(Suppliers2.java:130)
at org.jclouds.rest.suppliers.MemoizedRetryOnTimeOutButNotOnAuthorizationExceptionSupplier.get(MemoizedRetryOnTimeOutButNotOnAuthorizationExceptionSupplier.java:64)
at org.jclouds.compute.domain.internal.TemplateBuilderImpl.getImages(TemplateBuilderImpl.java:737)
at org.jclouds.compute.domain.internal.TemplateBuilderImpl.build(TemplateBuilderImpl.java:612)
at org.jclouds.compute.domain.internal.TemplateBuilderImpl.build(TemplateBuilderImpl.java:606)
at org.jclouds.compute.internal.BaseTemplateBuilderLiveTest.testTemplateBuilderCanUseImageId(BaseTemplateBuilderLiveTest.java:159)
at sun.reflect.NativeMethodAccessorImpl.invoke0(Native Method)
at sun.reflect.NativeMethodAccessorImpl.invoke(NativeMethodAccessorImpl.java:39)
at sun.reflect.DelegatingMethodAccessorImpl.invoke(DelegatingMethodAccessorImpl.java:25)
at java.lang.reflect.Method.invoke(Method.java:597)
at org.testng.internal.MethodInvocationHelper.invokeMethod(MethodInvocationHelper.java:80)
at org.testng.internal.Invoker.invokeMethod(Invoker.java:701)
at org.testng.internal.Invoker.invokeTestMethod(Invoker.java:893)
at org.testng.internal.Invoker.invokeTestMethods(Invoker.java:1218)
at org.testng.internal.TestMethodWorker.invokeTestMethods(TestMethodWorker.java:127)
at org.testng.internal.TestMethodWorker.run(TestMethodWorker.java:111)
at org.testng.TestRunner.privateRun(TestRunner.java:758)
at org.testng.TestRunner.run(TestRunner.java:613)
at org.testng.SuiteRunner.runTest(SuiteRunner.java:334)
at org.testng.SuiteRunner.access$000(SuiteRunner.java:37)
at org.testng.SuiteRunner$SuiteWorker.run(SuiteRunner.java:368)
at org.testng.internal.thread.ThreadUtil$2.call(ThreadUtil.java:64)
at java.util.concurrent.FutureTask$Sync.innerRun(FutureTask.java:303)
at java.util.concurrent.FutureTask.run(FutureTask.java:138)
at java.util.concurrent.ThreadPoolExecutor$Worker.runTask(ThreadPoolExecutor.java:886)
at java.util.concurrent.ThreadPoolExecutor$Worker.run(ThreadPoolExecutor.java:908)
at java.lang.Thread.run(Thread.java:680)
testTemplateBuilderCannotFind(org.jclouds.openhosting.compute.OpenHostingEast1TemplateBuilderLiveTest) Time elapsed: 0.025 sec <<< FAILURE!
org.testng.TestException:
Expected exception java.util.NoSuchElementException but got java.lang.ClassCastException: org.jclouds.elasticstack.domain.DriveInfo cannot be cast to java.lang.Comparable
at org.testng.internal.Invoker.handleInvocationResults(Invoker.java:1475)
at org.testng.internal.Invoker.invokeMethod(Invoker.java:750)
at org.testng.internal.Invoker.invokeTestMethod(Invoker.java:893)
at org.testng.internal.Invoker.invokeTestMethods(Invoker.java:1218)
at org.testng.internal.TestMethodWorker.invokeTestMethods(TestMethodWorker.java:127)
at org.testng.internal.TestMethodWorker.run(TestMethodWorker.java:111)
at org.testng.TestRunner.privateRun(TestRunner.java:758)
at org.testng.TestRunner.run(TestRunner.java:613)
at org.testng.SuiteRunner.runTest(SuiteRunner.java:334)
at org.testng.SuiteRunner.access$000(SuiteRunner.java:37)
at org.testng.SuiteRunner$SuiteWorker.run(SuiteRunner.java:368)
at org.testng.internal.thread.ThreadUtil$2.call(ThreadUtil.java:64)
at java.util.concurrent.FutureTask$Sync.innerRun(FutureTask.java:303)
at java.util.concurrent.FutureTask.run(FutureTask.java:138)
at java.util.concurrent.ThreadPoolExecutor$Worker.runTask(ThreadPoolExecutor.java:886)
at java.util.concurrent.ThreadPoolExecutor$Worker.run(ThreadPoolExecutor.java:908)
at java.lang.Thread.run(Thread.java:680)
Caused by: java.lang.ClassCastException: org.jclouds.elasticstack.domain.DriveInfo cannot be cast to java.lang.Comparable
at com.google.common.collect.NaturalOrdering.compare(NaturalOrdering.java:28)
at java.util.Arrays.mergeSort(Arrays.java:1270)
at java.util.Arrays.mergeSort(Arrays.java:1281)
at java.util.Arrays.sort(Arrays.java:1210)
at com.google.common.collect.SortedIterables.sortedUnique(SortedIterables.java:95)
at com.google.common.collect.ImmutableSortedSet.copyOfInternal(ImmutableSortedSet.java:408)
at com.google.common.collect.ImmutableSortedSet.copyOf(ImmutableSortedSet.java:343)
at com.google.common.collect.ImmutableSortedSet.copyOf(ImmutableSortedSet.java:251)
at org.jclouds.util.Iterables2.concreteCopy(Iterables2.java:37)
at org.jclouds.elasticstack.compute.ElasticStackComputeServiceAdapter.listImages(ElasticStackComputeServiceAdapter.java:187)
at org.jclouds.compute.config.ComputeServiceAdapterContextModule$2.get(ComputeServiceAdapterContextModule.java:116)
at org.jclouds.compute.config.ComputeServiceAdapterContextModule$2.get(ComputeServiceAdapterContextModule.java:112)
at org.jclouds.collect.TransformingSetSupplier.get(TransformingSetSupplier.java:47)
at org.jclouds.collect.TransformingSetSupplier.get(TransformingSetSupplier.java:36)
at org.jclouds.compute.config.BaseComputeServiceContextModule$9.get(BaseComputeServiceContextModule.java:247)
at org.jclouds.compute.config.BaseComputeServiceContextModule$9.get(BaseComputeServiceContextModule.java:244)
at org.jclouds.rest.suppliers.SetAndThrowAuthorizationExceptionSupplier.get(SetAndThrowAuthorizationExceptionSupplier.java:49)
at org.jclouds.concurrent.RetryOnTimeOutExceptionSupplier.get(RetryOnTimeOutExceptionSupplier.java:47)
at org.jclouds.util.Suppliers2$ExpiringMemoizingSupplier.get(Suppliers2.java:130)
at org.jclouds.rest.suppliers.MemoizedRetryOnTimeOutButNotOnAuthorizationExceptionSupplier.get(MemoizedRetryOnTimeOutButNotOnAuthorizationExceptionSupplier.java:64)
at org.jclouds.compute.domain.internal.TemplateBuilderImpl.getImages(TemplateBuilderImpl.java:737)
at org.jclouds.compute.domain.internal.TemplateBuilderImpl.build(TemplateBuilderImpl.java:612)
at org.jclouds.compute.internal.BaseTemplateBuilderLiveTest.testTemplateBuilderCannotFind(BaseTemplateBuilderLiveTest.java:154)
at sun.reflect.NativeMethodAccessorImpl.invoke0(Native Method)
at sun.reflect.NativeMethodAccessorImpl.invoke(NativeMethodAccessorImpl.java:39)
at sun.reflect.DelegatingMethodAccessorImpl.invoke(DelegatingMethodAccessorImpl.java:25)
at java.lang.reflect.Method.invoke(Method.java:597)
at org.testng.internal.MethodInvocationHelper.invokeMethod(MethodInvocationHelper.java:80)
at org.testng.internal.Invoker.invokeMethod(Invoker.java:701)
... 15 more
Caused by: java.lang.ClassCastException: org.jclouds.elasticstack.domain.DriveInfo cannot be cast to java.lang.Comparable
at com.google.common.collect.NaturalOrdering.compare(NaturalOrdering.java:28)
at java.util.Arrays.mergeSort(Arrays.java:1270)
at java.util.Arrays.mergeSort(Arrays.java:1281)
at java.util.Arrays.sort(Arrays.java:1210)
at com.google.common.collect.SortedIterables.sortedUnique(SortedIterables.java:95)
at com.google.common.collect.ImmutableSortedSet.copyOfInternal(ImmutableSortedSet.java:408)
at com.google.common.collect.ImmutableSortedSet.copyOf(ImmutableSortedSet.java:343)
at com.google.common.collect.ImmutableSortedSet.copyOf(ImmutableSortedSet.java:251)
at org.jclouds.util.Iterables2.concreteCopy(Iterables2.java:37)
at org.jclouds.elasticstack.compute.ElasticStackComputeServiceAdapter.listImages(ElasticStackComputeServiceAdapter.java:187)
at org.jclouds.compute.config.ComputeServiceAdapterContextModule$2.get(ComputeServiceAdapterContextModule.java:116)
at org.jclouds.compute.config.ComputeServiceAdapterContextModule$2.get(ComputeServiceAdapterContextModule.java:112)
at org.jclouds.collect.TransformingSetSupplier.get(TransformingSetSupplier.java:47)
at org.jclouds.collect.TransformingSetSupplier.get(TransformingSetSupplier.java:36)
at org.jclouds.compute.config.BaseComputeServiceContextModule$9.get(BaseComputeServiceContextModule.java:247)
at org.jclouds.compute.config.BaseComputeServiceContextModule$9.get(BaseComputeServiceContextModule.java:244)
at org.jclouds.rest.suppliers.SetAndThrowAuthorizationExceptionSupplier.get(SetAndThrowAuthorizationExceptionSupplier.java:49)
at org.jclouds.concurrent.RetryOnTimeOutExceptionSupplier.get(RetryOnTimeOutExceptionSupplier.java:47)
at org.jclouds.util.Suppliers2$ExpiringMemoizingSupplier.get(Suppliers2.java:130)
at org.jclouds.rest.suppliers.MemoizedRetryOnTimeOutButNotOnAuthorizationExceptionSupplier.get(MemoizedRetryOnTimeOutButNotOnAuthorizationExceptionSupplier.java:64)
at org.jclouds.compute.domain.internal.TemplateBuilderImpl.getImages(TemplateBuilderImpl.java:737)
at org.jclouds.compute.domain.internal.TemplateBuilderImpl.build(TemplateBuilderImpl.java:612)
at org.jclouds.compute.internal.BaseTemplateBuilderLiveTest.testTemplateBuilderCannotFind(BaseTemplateBuilderLiveTest.java:154)
at sun.reflect.NativeMethodAccessorImpl.invoke0(Native Method)
at sun.reflect.NativeMethodAccessorImpl.invoke(NativeMethodAccessorImpl.java:39)
at sun.reflect.DelegatingMethodAccessorImpl.invoke(DelegatingMethodAccessorImpl.java:25)
at java.lang.reflect.Method.invoke(Method.java:597)
at org.testng.internal.MethodInvocationHelper.invokeMethod(MethodInvocationHelper.java:80)
at org.testng.internal.Invoker.invokeMethod(Invoker.java:701)
... 15 more
testTemplateBuilderCannotFind(org.jclouds.openhosting.compute.OpenHostingEast1TemplateBuilderLiveTest) Time elapsed: 0.001 sec <<< FAILURE!
org.testng.TestException:
Expected exception java.util.NoSuchElementException but got java.lang.ClassCastException: org.jclouds.elasticstack.domain.DriveInfo cannot be cast to java.lang.Comparable
at org.testng.internal.Invoker.handleInvocationResults(Invoker.java:1475)
at org.testng.internal.Invoker.invokeMethod(Invoker.java:750)
at org.testng.internal.Invoker.invokeTestMethod(Invoker.java:893)
at org.testng.internal.Invoker.invokeTestMethods(Invoker.java:1218)
at org.testng.internal.TestMethodWorker.invokeTestMethods(TestMethodWorker.java:127)
at org.testng.internal.TestMethodWorker.run(TestMethodWorker.java:111)
at org.testng.TestRunner.privateRun(TestRunner.java:758)
at org.testng.TestRunner.run(TestRunner.java:613)
at org.testng.SuiteRunner.runTest(SuiteRunner.java:334)
at org.testng.SuiteRunner.access$000(SuiteRunner.java:37)
at org.testng.SuiteRunner$SuiteWorker.run(SuiteRunner.java:368)
at org.testng.internal.thread.ThreadUtil$2.call(ThreadUtil.java:64)
at java.util.concurrent.FutureTask$Sync.innerRun(FutureTask.java:303)
at java.util.concurrent.FutureTask.run(FutureTask.java:138)
at java.util.concurrent.ThreadPoolExecutor$Worker.runTask(ThreadPoolExecutor.java:886)
at java.util.concurrent.ThreadPoolExecutor$Worker.run(ThreadPoolExecutor.java:908)
at java.lang.Thread.run(Thread.java:680)
Caused by: java.lang.ClassCastException: org.jclouds.elasticstack.domain.DriveInfo cannot be cast to java.lang.Comparable
at com.google.common.collect.NaturalOrdering.compare(NaturalOrdering.java:28)
at java.util.Arrays.mergeSort(Arrays.java:1270)
at java.util.Arrays.mergeSort(Arrays.java:1281)
at java.util.Arrays.sort(Arrays.java:1210)
at com.google.common.collect.SortedIterables.sortedUnique(SortedIterables.java:95)
at com.google.common.collect.ImmutableSortedSet.copyOfInternal(ImmutableSortedSet.java:408)
at com.google.common.collect.ImmutableSortedSet.copyOf(ImmutableSortedSet.java:343)
at com.google.common.collect.ImmutableSortedSet.copyOf(ImmutableSortedSet.java:251)
at org.jclouds.util.Iterables2.concreteCopy(Iterables2.java:37)
at org.jclouds.elasticstack.compute.ElasticStackComputeServiceAdapter.listImages(ElasticStackComputeServiceAdapter.java:187)
at org.jclouds.compute.config.ComputeServiceAdapterContextModule$2.get(ComputeServiceAdapterContextModule.java:116)
at org.jclouds.compute.config.ComputeServiceAdapterContextModule$2.get(ComputeServiceAdapterContextModule.java:112)
at org.jclouds.collect.TransformingSetSupplier.get(TransformingSetSupplier.java:47)
at org.jclouds.collect.TransformingSetSupplier.get(TransformingSetSupplier.java:36)
at org.jclouds.compute.config.BaseComputeServiceContextModule$9.get(BaseComputeServiceContextModule.java:247)
at org.jclouds.compute.config.BaseComputeServiceContextModule$9.get(BaseComputeServiceContextModule.java:244)
at org.jclouds.rest.suppliers.SetAndThrowAuthorizationExceptionSupplier.get(SetAndThrowAuthorizationExceptionSupplier.java:49)
at org.jclouds.concurrent.RetryOnTimeOutExceptionSupplier.get(RetryOnTimeOutExceptionSupplier.java:47)
at org.jclouds.util.Suppliers2$ExpiringMemoizingSupplier.get(Suppliers2.java:130)
at org.jclouds.rest.suppliers.MemoizedRetryOnTimeOutButNotOnAuthorizationExceptionSupplier.get(MemoizedRetryOnTimeOutButNotOnAuthorizationExceptionSupplier.java:64)
at org.jclouds.compute.domain.internal.TemplateBuilderImpl.getImages(TemplateBuilderImpl.java:737)
at org.jclouds.compute.domain.internal.TemplateBuilderImpl.build(TemplateBuilderImpl.java:612)
at org.jclouds.compute.internal.BaseTemplateBuilderLiveTest.testTemplateBuilderCannotFind(BaseTemplateBuilderLiveTest.java:154)
at sun.reflect.NativeMethodAccessorImpl.invoke0(Native Method)
at sun.reflect.NativeMethodAccessorImpl.invoke(NativeMethodAccessorImpl.java:39)
at sun.reflect.DelegatingMethodAccessorImpl.invoke(DelegatingMethodAccessorImpl.java:25)
at java.lang.reflect.Method.invoke(Method.java:597)
at org.testng.internal.MethodInvocationHelper.invokeMethod(MethodInvocationHelper.java:80)
at org.testng.internal.Invoker.invokeMethod(Invoker.java:701)
... 15 more
Caused by: java.lang.ClassCastException: org.jclouds.elasticstack.domain.DriveInfo cannot be cast to java.lang.Comparable
at com.google.common.collect.NaturalOrdering.compare(NaturalOrdering.java:28)
at java.util.Arrays.mergeSort(Arrays.java:1270)
at java.util.Arrays.mergeSort(Arrays.java:1281)
at java.util.Arrays.sort(Arrays.java:1210)
at com.google.common.collect.SortedIterables.sortedUnique(SortedIterables.java:95)
at com.google.common.collect.ImmutableSortedSet.copyOfInternal(ImmutableSortedSet.java:408)
at com.google.common.collect.ImmutableSortedSet.copyOf(ImmutableSortedSet.java:343)
at com.google.common.collect.ImmutableSortedSet.copyOf(ImmutableSortedSet.java:251)
at org.jclouds.util.Iterables2.concreteCopy(Iterables2.java:37)
at org.jclouds.elasticstack.compute.ElasticStackComputeServiceAdapter.listImages(ElasticStackComputeServiceAdapter.java:187)
at org.jclouds.compute.config.ComputeServiceAdapterContextModule$2.get(ComputeServiceAdapterContextModule.java:116)
at org.jclouds.compute.config.ComputeServiceAdapterContextModule$2.get(ComputeServiceAdapterContextModule.java:112)
at org.jclouds.collect.TransformingSetSupplier.get(TransformingSetSupplier.java:47)
at org.jclouds.collect.TransformingSetSupplier.get(TransformingSetSupplier.java:36)
at org.jclouds.compute.config.BaseComputeServiceContextModule$9.get(BaseComputeServiceContextModule.java:247)
at org.jclouds.compute.config.BaseComputeServiceContextModule$9.get(BaseComputeServiceContextModule.java:244)
at org.jclouds.rest.suppliers.SetAndThrowAuthorizationExceptionSupplier.get(SetAndThrowAuthorizationExceptionSupplier.java:49)
at org.jclouds.concurrent.RetryOnTimeOutExceptionSupplier.get(RetryOnTimeOutExceptionSupplier.java:47)
at org.jclouds.util.Suppliers2$ExpiringMemoizingSupplier.get(Suppliers2.java:130)
at org.jclouds.rest.suppliers.MemoizedRetryOnTimeOutButNotOnAuthorizationExceptionSupplier.get(MemoizedRetryOnTimeOutButNotOnAuthorizationExceptionSupplier.java:64)
at org.jclouds.compute.domain.internal.TemplateBuilderImpl.getImages(TemplateBuilderImpl.java:737)
at org.jclouds.compute.domain.internal.TemplateBuilderImpl.build(TemplateBuilderImpl.java:612)
at org.jclouds.compute.internal.BaseTemplateBuilderLiveTest.testTemplateBuilderCannotFind(BaseTemplateBuilderLiveTest.java:154)
at sun.reflect.NativeMethodAccessorImpl.invoke0(Native Method)
at sun.reflect.NativeMethodAccessorImpl.invoke(NativeMethodAccessorImpl.java:39)
at sun.reflect.DelegatingMethodAccessorImpl.invoke(DelegatingMethodAccessorImpl.java:25)
at java.lang.reflect.Method.invoke(Method.java:597)
at org.testng.internal.MethodInvocationHelper.invokeMethod(MethodInvocationHelper.java:80)
at org.testng.internal.Invoker.invokeMethod(Invoker.java:701)
... 15 more
testTemplateBuilderCannotFind(org.jclouds.openhosting.compute.OpenHostingEast1TemplateBuilderLiveTest) Time elapsed: 0.002 sec <<< FAILURE!
org.testng.TestException:
Expected exception java.util.NoSuchElementException but got java.lang.ClassCastException: org.jclouds.elasticstack.domain.DriveInfo cannot be cast to java.lang.Comparable
at org.testng.internal.Invoker.handleInvocationResults(Invoker.java:1475)
at org.testng.internal.Invoker.invokeMethod(Invoker.java:750)
at org.testng.internal.Invoker.invokeTestMethod(Invoker.java:893)
at org.testng.internal.Invoker.invokeTestMethods(Invoker.java:1218)
at org.testng.internal.TestMethodWorker.invokeTestMethods(TestMethodWorker.java:127)
at org.testng.internal.TestMethodWorker.run(TestMethodWorker.java:111)
at org.testng.TestRunner.privateRun(TestRunner.java:758)
at org.testng.TestRunner.run(TestRunner.java:613)
at org.testng.SuiteRunner.runTest(SuiteRunner.java:334)
at org.testng.SuiteRunner.access$000(SuiteRunner.java:37)
at org.testng.SuiteRunner$SuiteWorker.run(SuiteRunner.java:368)
at org.testng.internal.thread.ThreadUtil$2.call(ThreadUtil.java:64)
at java.util.concurrent.FutureTask$Sync.innerRun(FutureTask.java:303)
at java.util.concurrent.FutureTask.run(FutureTask.java:138)
at java.util.concurrent.ThreadPoolExecutor$Worker.runTask(ThreadPoolExecutor.java:886)
at java.util.concurrent.ThreadPoolExecutor$Worker.run(ThreadPoolExecutor.java:908)
at java.lang.Thread.run(Thread.java:680)
Caused by: java.lang.ClassCastException: org.jclouds.elasticstack.domain.DriveInfo cannot be cast to java.lang.Comparable
at com.google.common.collect.NaturalOrdering.compare(NaturalOrdering.java:28)
at java.util.Arrays.mergeSort(Arrays.java:1270)
at java.util.Arrays.mergeSort(Arrays.java:1281)
at java.util.Arrays.sort(Arrays.java:1210)
at com.google.common.collect.SortedIterables.sortedUnique(SortedIterables.java:95)
at com.google.common.collect.ImmutableSortedSet.copyOfInternal(ImmutableSortedSet.java:408)
at com.google.common.collect.ImmutableSortedSet.copyOf(ImmutableSortedSet.java:343)
at com.google.common.collect.ImmutableSortedSet.copyOf(ImmutableSortedSet.java:251)
at org.jclouds.util.Iterables2.concreteCopy(Iterables2.java:37)
at org.jclouds.elasticstack.compute.ElasticStackComputeServiceAdapter.listImages(ElasticStackComputeServiceAdapter.java:187)
at org.jclouds.compute.config.ComputeServiceAdapterContextModule$2.get(ComputeServiceAdapterContextModule.java:116)
at org.jclouds.compute.config.ComputeServiceAdapterContextModule$2.get(ComputeServiceAdapterContextModule.java:112)
at org.jclouds.collect.TransformingSetSupplier.get(TransformingSetSupplier.java:47)
at org.jclouds.collect.TransformingSetSupplier.get(TransformingSetSupplier.java:36)
at org.jclouds.compute.config.BaseComputeServiceContextModule$9.get(BaseComputeServiceContextModule.java:247)
at org.jclouds.compute.config.BaseComputeServiceContextModule$9.get(BaseComputeServiceContextModule.java:244)
at org.jclouds.rest.suppliers.SetAndThrowAuthorizationExceptionSupplier.get(SetAndThrowAuthorizationExceptionSupplier.java:49)
at org.jclouds.concurrent.RetryOnTimeOutExceptionSupplier.get(RetryOnTimeOutExceptionSupplier.java:47)
at org.jclouds.util.Suppliers2$ExpiringMemoizingSupplier.get(Suppliers2.java:130)
at org.jclouds.rest.suppliers.MemoizedRetryOnTimeOutButNotOnAuthorizationExceptionSupplier.get(MemoizedRetryOnTimeOutButNotOnAuthorizationExceptionSupplier.java:64)
at org.jclouds.compute.domain.internal.TemplateBuilderImpl.getImages(TemplateBuilderImpl.java:737)
at org.jclouds.compute.domain.internal.TemplateBuilderImpl.build(TemplateBuilderImpl.java:612)
at org.jclouds.compute.internal.BaseTemplateBuilderLiveTest.testTemplateBuilderCannotFind(BaseTemplateBuilderLiveTest.java:154)
at sun.reflect.NativeMethodAccessorImpl.invoke0(Native Method)
at sun.reflect.NativeMethodAccessorImpl.invoke(NativeMethodAccessorImpl.java:39)
at sun.reflect.DelegatingMethodAccessorImpl.invoke(DelegatingMethodAccessorImpl.java:25)
at java.lang.reflect.Method.invoke(Method.java:597)
at org.testng.internal.MethodInvocationHelper.invokeMethod(MethodInvocationHelper.java:80)
at org.testng.internal.Invoker.invokeMethod(Invoker.java:701)
... 15 more
Caused by: java.lang.ClassCastException: org.jclouds.elasticstack.domain.DriveInfo cannot be cast to java.lang.Comparable
at com.google.common.collect.NaturalOrdering.compare(NaturalOrdering.java:28)
at java.util.Arrays.mergeSort(Arrays.java:1270)
at java.util.Arrays.mergeSort(Arrays.java:1281)
at java.util.Arrays.sort(Arrays.java:1210)
at com.google.common.collect.SortedIterables.sortedUnique(SortedIterables.java:95)
at com.google.common.collect.ImmutableSortedSet.copyOfInternal(ImmutableSortedSet.java:408)
at com.google.common.collect.ImmutableSortedSet.copyOf(ImmutableSortedSet.java:343)
at com.google.common.collect.ImmutableSortedSet.copyOf(ImmutableSortedSet.java:251)
at org.jclouds.util.Iterables2.concreteCopy(Iterables2.java:37)
at org.jclouds.elasticstack.compute.ElasticStackComputeServiceAdapter.listImages(ElasticStackComputeServiceAdapter.java:187)
at org.jclouds.compute.config.ComputeServiceAdapterContextModule$2.get(ComputeServiceAdapterContextModule.java:116)
at org.jclouds.compute.config.ComputeServiceAdapterContextModule$2.get(ComputeServiceAdapterContextModule.java:112)
at org.jclouds.collect.TransformingSetSupplier.get(TransformingSetSupplier.java:47)
at org.jclouds.collect.TransformingSetSupplier.get(TransformingSetSupplier.java:36)
at org.jclouds.compute.config.BaseComputeServiceContextModule$9.get(BaseComputeServiceContextModule.java:247)
at org.jclouds.compute.config.BaseComputeServiceContextModule$9.get(BaseComputeServiceContextModule.java:244)
at org.jclouds.rest.suppliers.SetAndThrowAuthorizationExceptionSupplier.get(SetAndThrowAuthorizationExceptionSupplier.java:49)
at org.jclouds.concurrent.RetryOnTimeOutExceptionSupplier.get(RetryOnTimeOutExceptionSupplier.java:47)
at org.jclouds.util.Suppliers2$ExpiringMemoizingSupplier.get(Suppliers2.java:130)
at org.jclouds.rest.suppliers.MemoizedRetryOnTimeOutButNotOnAuthorizationExceptionSupplier.get(MemoizedRetryOnTimeOutButNotOnAuthorizationExceptionSupplier.java:64)
at org.jclouds.compute.domain.internal.TemplateBuilderImpl.getImages(TemplateBuilderImpl.java:737)
at org.jclouds.compute.domain.internal.TemplateBuilderImpl.build(TemplateBuilderImpl.java:612)
at org.jclouds.compute.internal.BaseTemplateBuilderLiveTest.testTemplateBuilderCannotFind(BaseTemplateBuilderLiveTest.java:154)
at sun.reflect.NativeMethodAccessorImpl.invoke0(Native Method)
at sun.reflect.NativeMethodAccessorImpl.invoke(NativeMethodAccessorImpl.java:39)
at sun.reflect.DelegatingMethodAccessorImpl.invoke(DelegatingMethodAccessorImpl.java:25)
at java.lang.reflect.Method.invoke(Method.java:597)
at org.testng.internal.MethodInvocationHelper.invokeMethod(MethodInvocationHelper.java:80)
at org.testng.internal.Invoker.invokeMethod(Invoker.java:701)
... 15 more
testTemplateBuilderCannotFind(org.jclouds.openhosting.compute.OpenHostingEast1TemplateBuilderLiveTest) Time elapsed: 0.001 sec <<< FAILURE!
org.testng.TestException:
Expected exception java.util.NoSuchElementException but got java.lang.ClassCastException: org.jclouds.elasticstack.domain.DriveInfo cannot be cast to java.lang.Comparable
at org.testng.internal.Invoker.handleInvocationResults(Invoker.java:1475)
at org.testng.internal.Invoker.invokeMethod(Invoker.java:750)
at org.testng.internal.Invoker.invokeTestMethod(Invoker.java:893)
at org.testng.internal.Invoker.invokeTestMethods(Invoker.java:1218)
at org.testng.internal.TestMethodWorker.invokeTestMethods(TestMethodWorker.java:127)
at org.testng.internal.TestMethodWorker.run(TestMethodWorker.java:111)
at org.testng.TestRunner.privateRun(TestRunner.java:758)
at org.testng.TestRunner.run(TestRunner.java:613)
at org.testng.SuiteRunner.runTest(SuiteRunner.java:334)
at org.testng.SuiteRunner.access$000(SuiteRunner.java:37)
at org.testng.SuiteRunner$SuiteWorker.run(SuiteRunner.java:368)
at org.testng.internal.thread.ThreadUtil$2.call(ThreadUtil.java:64)
at java.util.concurrent.FutureTask$Sync.innerRun(FutureTask.java:303)
at java.util.concurrent.FutureTask.run(FutureTask.java:138)
at java.util.concurrent.ThreadPoolExecutor$Worker.runTask(ThreadPoolExecutor.java:886)
at java.util.concurrent.ThreadPoolExecutor$Worker.run(ThreadPoolExecutor.java:908)
at java.lang.Thread.run(Thread.java:680)
Caused by: java.lang.ClassCastException: org.jclouds.elasticstack.domain.DriveInfo cannot be cast to java.lang.Comparable
at com.google.common.collect.NaturalOrdering.compare(NaturalOrdering.java:28)
at java.util.Arrays.mergeSort(Arrays.java:1270)
at java.util.Arrays.mergeSort(Arrays.java:1281)
at java.util.Arrays.sort(Arrays.java:1210)
at com.google.common.collect.SortedIterables.sortedUnique(SortedIterables.java:95)
at com.google.common.collect.ImmutableSortedSet.copyOfInternal(ImmutableSortedSet.java:408)
at com.google.common.collect.ImmutableSortedSet.copyOf(ImmutableSortedSet.java:343)
at com.google.common.collect.ImmutableSortedSet.copyOf(ImmutableSortedSet.java:251)
at org.jclouds.util.Iterables2.concreteCopy(Iterables2.java:37)
at org.jclouds.elasticstack.compute.ElasticStackComputeServiceAdapter.listImages(ElasticStackComputeServiceAdapter.java:187)
at org.jclouds.compute.config.ComputeServiceAdapterContextModule$2.get(ComputeServiceAdapterContextModule.java:116)
at org.jclouds.compute.config.ComputeServiceAdapterContextModule$2.get(ComputeServiceAdapterContextModule.java:112)
at org.jclouds.collect.TransformingSetSupplier.get(TransformingSetSupplier.java:47)
at org.jclouds.collect.TransformingSetSupplier.get(TransformingSetSupplier.java:36)
at org.jclouds.compute.config.BaseComputeServiceContextModule$9.get(BaseComputeServiceContextModule.java:247)
at org.jclouds.compute.config.BaseComputeServiceContextModule$9.get(BaseComputeServiceContextModule.java:244)
at org.jclouds.rest.suppliers.SetAndThrowAuthorizationExceptionSupplier.get(SetAndThrowAuthorizationExceptionSupplier.java:49)
at org.jclouds.concurrent.RetryOnTimeOutExceptionSupplier.get(RetryOnTimeOutExceptionSupplier.java:47)
at org.jclouds.util.Suppliers2$ExpiringMemoizingSupplier.get(Suppliers2.java:130)
at org.jclouds.rest.suppliers.MemoizedRetryOnTimeOutButNotOnAuthorizationExceptionSupplier.get(MemoizedRetryOnTimeOutButNotOnAuthorizationExceptionSupplier.java:64)
at org.jclouds.compute.domain.internal.TemplateBuilderImpl.getImages(TemplateBuilderImpl.java:737)
at org.jclouds.compute.domain.internal.TemplateBuilderImpl.build(TemplateBuilderImpl.java:612)
at org.jclouds.compute.internal.BaseTemplateBuilderLiveTest.testTemplateBuilderCannotFind(BaseTemplateBuilderLiveTest.java:154)
at sun.reflect.NativeMethodAccessorImpl.invoke0(Native Method)
at sun.reflect.NativeMethodAccessorImpl.invoke(NativeMethodAccessorImpl.java:39)
at sun.reflect.DelegatingMethodAccessorImpl.invoke(DelegatingMethodAccessorImpl.java:25)
at java.lang.reflect.Method.invoke(Method.java:597)
at org.testng.internal.MethodInvocationHelper.invokeMethod(MethodInvocationHelper.java:80)
at org.testng.internal.Invoker.invokeMethod(Invoker.java:701)
... 15 more
Caused by: java.lang.ClassCastException: org.jclouds.elasticstack.domain.DriveInfo cannot be cast to java.lang.Comparable
at com.google.common.collect.NaturalOrdering.compare(NaturalOrdering.java:28)
at java.util.Arrays.mergeSort(Arrays.java:1270)
at java.util.Arrays.mergeSort(Arrays.java:1281)
at java.util.Arrays.sort(Arrays.java:1210)
at com.google.common.collect.SortedIterables.sortedUnique(SortedIterables.java:95)
at com.google.common.collect.ImmutableSortedSet.copyOfInternal(ImmutableSortedSet.java:408)
at com.google.common.collect.ImmutableSortedSet.copyOf(ImmutableSortedSet.java:343)
at com.google.common.collect.ImmutableSortedSet.copyOf(ImmutableSortedSet.java:251)
at org.jclouds.util.Iterables2.concreteCopy(Iterables2.java:37)
at org.jclouds.elasticstack.compute.ElasticStackComputeServiceAdapter.listImages(ElasticStackComputeServiceAdapter.java:187)
at org.jclouds.compute.config.ComputeServiceAdapterContextModule$2.get(ComputeServiceAdapterContextModule.java:116)
at org.jclouds.compute.config.ComputeServiceAdapterContextModule$2.get(ComputeServiceAdapterContextModule.java:112)
at org.jclouds.collect.TransformingSetSupplier.get(TransformingSetSupplier.java:47)
at org.jclouds.collect.TransformingSetSupplier.get(TransformingSetSupplier.java:36)
at org.jclouds.compute.config.BaseComputeServiceContextModule$9.get(BaseComputeServiceContextModule.java:247)
at org.jclouds.compute.config.BaseComputeServiceContextModule$9.get(BaseComputeServiceContextModule.java:244)
at org.jclouds.rest.suppliers.SetAndThrowAuthorizationExceptionSupplier.get(SetAndThrowAuthorizationExceptionSupplier.java:49)
at org.jclouds.concurrent.RetryOnTimeOutExceptionSupplier.get(RetryOnTimeOutExceptionSupplier.java:47)
at org.jclouds.util.Suppliers2$ExpiringMemoizingSupplier.get(Suppliers2.java:130)
at org.jclouds.rest.suppliers.MemoizedRetryOnTimeOutButNotOnAuthorizationExceptionSupplier.get(MemoizedRetryOnTimeOutButNotOnAuthorizationExceptionSupplier.java:64)
at org.jclouds.compute.domain.internal.TemplateBuilderImpl.getImages(TemplateBuilderImpl.java:737)
at org.jclouds.compute.domain.internal.TemplateBuilderImpl.build(TemplateBuilderImpl.java:612)
at org.jclouds.compute.internal.BaseTemplateBuilderLiveTest.testTemplateBuilderCannotFind(BaseTemplateBuilderLiveTest.java:154)
at sun.reflect.NativeMethodAccessorImpl.invoke0(Native Method)
at sun.reflect.NativeMethodAccessorImpl.invoke(NativeMethodAccessorImpl.java:39)
at sun.reflect.DelegatingMethodAccessorImpl.invoke(DelegatingMethodAccessorImpl.java:25)
at java.lang.reflect.Method.invoke(Method.java:597)
at org.testng.internal.MethodInvocationHelper.invokeMethod(MethodInvocationHelper.java:80)
at org.testng.internal.Invoker.invokeMethod(Invoker.java:701)
... 15 more
testTemplateBuilderCannotFind(org.jclouds.openhosting.compute.OpenHostingEast1TemplateBuilderLiveTest) Time elapsed: 0.003 sec <<< FAILURE!
org.testng.TestException:
Expected exception java.util.NoSuchElementException but got java.lang.ClassCastException: org.jclouds.elasticstack.domain.DriveInfo cannot be cast to java.lang.Comparable
at org.testng.internal.Invoker.handleInvocationResults(Invoker.java:1475)
at org.testng.internal.Invoker.invokeMethod(Invoker.java:750)
at org.testng.internal.Invoker.invokeTestMethod(Invoker.java:893)
at org.testng.internal.Invoker.invokeTestMethods(Invoker.java:1218)
at org.testng.internal.TestMethodWorker.invokeTestMethods(TestMethodWorker.java:127)
at org.testng.internal.TestMethodWorker.run(TestMethodWorker.java:111)
at org.testng.TestRunner.privateRun(TestRunner.java:758)
at org.testng.TestRunner.run(TestRunner.java:613)
at org.testng.SuiteRunner.runTest(SuiteRunner.java:334)
at org.testng.SuiteRunner.access$000(SuiteRunner.java:37)
at org.testng.SuiteRunner$SuiteWorker.run(SuiteRunner.java:368)
at org.testng.internal.thread.ThreadUtil$2.call(ThreadUtil.java:64)
at java.util.concurrent.FutureTask$Sync.innerRun(FutureTask.java:303)
at java.util.concurrent.FutureTask.run(FutureTask.java:138)
at java.util.concurrent.ThreadPoolExecutor$Worker.runTask(ThreadPoolExecutor.java:886)
at java.util.concurrent.ThreadPoolExecutor$Worker.run(ThreadPoolExecutor.java:908)
at java.lang.Thread.run(Thread.java:680)
Caused by: java.lang.ClassCastException: org.jclouds.elasticstack.domain.DriveInfo cannot be cast to java.lang.Comparable
at com.google.common.collect.NaturalOrdering.compare(NaturalOrdering.java:28)
at java.util.Arrays.mergeSort(Arrays.java:1270)
at java.util.Arrays.mergeSort(Arrays.java:1281)
at java.util.Arrays.sort(Arrays.java:1210)
at com.google.common.collect.SortedIterables.sortedUnique(SortedIterables.java:95)
at com.google.common.collect.ImmutableSortedSet.copyOfInternal(ImmutableSortedSet.java:408)
at com.google.common.collect.ImmutableSortedSet.copyOf(ImmutableSortedSet.java:343)
at com.google.common.collect.ImmutableSortedSet.copyOf(ImmutableSortedSet.java:251)
at org.jclouds.util.Iterables2.concreteCopy(Iterables2.java:37)
at org.jclouds.elasticstack.compute.ElasticStackComputeServiceAdapter.listImages(ElasticStackComputeServiceAdapter.java:187)
at org.jclouds.compute.config.ComputeServiceAdapterContextModule$2.get(ComputeServiceAdapterContextModule.java:116)
at org.jclouds.compute.config.ComputeServiceAdapterContextModule$2.get(ComputeServiceAdapterContextModule.java:112)
at org.jclouds.collect.TransformingSetSupplier.get(TransformingSetSupplier.java:47)
at org.jclouds.collect.TransformingSetSupplier.get(TransformingSetSupplier.java:36)
at org.jclouds.compute.config.BaseComputeServiceContextModule$9.get(BaseComputeServiceContextModule.java:247)
at org.jclouds.compute.config.BaseComputeServiceContextModule$9.get(BaseComputeServiceContextModule.java:244)
at org.jclouds.rest.suppliers.SetAndThrowAuthorizationExceptionSupplier.get(SetAndThrowAuthorizationExceptionSupplier.java:49)
at org.jclouds.concurrent.RetryOnTimeOutExceptionSupplier.get(RetryOnTimeOutExceptionSupplier.java:47)
at org.jclouds.util.Suppliers2$ExpiringMemoizingSupplier.get(Suppliers2.java:130)
at org.jclouds.rest.suppliers.MemoizedRetryOnTimeOutButNotOnAuthorizationExceptionSupplier.get(MemoizedRetryOnTimeOutButNotOnAuthorizationExceptionSupplier.java:64)
at org.jclouds.compute.domain.internal.TemplateBuilderImpl.getImages(TemplateBuilderImpl.java:737)
at org.jclouds.compute.domain.internal.TemplateBuilderImpl.build(TemplateBuilderImpl.java:612)
at org.jclouds.compute.internal.BaseTemplateBuilderLiveTest.testTemplateBuilderCannotFind(BaseTemplateBuilderLiveTest.java:154)
at sun.reflect.NativeMethodAccessorImpl.invoke0(Native Method)
at sun.reflect.NativeMethodAccessorImpl.invoke(NativeMethodAccessorImpl.java:39)
at sun.reflect.DelegatingMethodAccessorImpl.invoke(DelegatingMethodAccessorImpl.java:25)
at java.lang.reflect.Method.invoke(Method.java:597)
at org.testng.internal.MethodInvocationHelper.invokeMethod(MethodInvocationHelper.java:80)
at org.testng.internal.Invoker.invokeMethod(Invoker.java:701)
... 15 more
Caused by: java.lang.ClassCastException: org.jclouds.elasticstack.domain.DriveInfo cannot be cast to java.lang.Comparable
at com.google.common.collect.NaturalOrdering.compare(NaturalOrdering.java:28)
at java.util.Arrays.mergeSort(Arrays.java:1270)
at java.util.Arrays.mergeSort(Arrays.java:1281)
at java.util.Arrays.sort(Arrays.java:1210)
at com.google.common.collect.SortedIterables.sortedUnique(SortedIterables.java:95)
at com.google.common.collect.ImmutableSortedSet.copyOfInternal(ImmutableSortedSet.java:408)
at com.google.common.collect.ImmutableSortedSet.copyOf(ImmutableSortedSet.java:343)
at com.google.common.collect.ImmutableSortedSet.copyOf(ImmutableSortedSet.java:251)
at org.jclouds.util.Iterables2.concreteCopy(Iterables2.java:37)
at org.jclouds.elasticstack.compute.ElasticStackComputeServiceAdapter.listImages(ElasticStackComputeServiceAdapter.java:187)
at org.jclouds.compute.config.ComputeServiceAdapterContextModule$2.get(ComputeServiceAdapterContextModule.java:116)
at org.jclouds.compute.config.ComputeServiceAdapterContextModule$2.get(ComputeServiceAdapterContextModule.java:112)
at org.jclouds.collect.TransformingSetSupplier.get(TransformingSetSupplier.java:47)
at org.jclouds.collect.TransformingSetSupplier.get(TransformingSetSupplier.java:36)
at org.jclouds.compute.config.BaseComputeServiceContextModule$9.get(BaseComputeServiceContextModule.java:247)
at org.jclouds.compute.config.BaseComputeServiceContextModule$9.get(BaseComputeServiceContextModule.java:244)
at org.jclouds.rest.suppliers.SetAndThrowAuthorizationExceptionSupplier.get(SetAndThrowAuthorizationExceptionSupplier.java:49)
at org.jclouds.concurrent.RetryOnTimeOutExceptionSupplier.get(RetryOnTimeOutExceptionSupplier.java:47)
at org.jclouds.util.Suppliers2$ExpiringMemoizingSupplier.get(Suppliers2.java:130)
at org.jclouds.rest.suppliers.MemoizedRetryOnTimeOutButNotOnAuthorizationExceptionSupplier.get(MemoizedRetryOnTimeOutButNotOnAuthorizationExceptionSupplier.java:64)
at org.jclouds.compute.domain.internal.TemplateBuilderImpl.getImages(TemplateBuilderImpl.java:737)
at org.jclouds.compute.domain.internal.TemplateBuilderImpl.build(TemplateBuilderImpl.java:612)
at org.jclouds.compute.internal.BaseTemplateBuilderLiveTest.testTemplateBuilderCannotFind(BaseTemplateBuilderLiveTest.java:154)
at sun.reflect.NativeMethodAccessorImpl.invoke0(Native Method)
at sun.reflect.NativeMethodAccessorImpl.invoke(NativeMethodAccessorImpl.java:39)
at sun.reflect.DelegatingMethodAccessorImpl.invoke(DelegatingMethodAccessorImpl.java:25)
at java.lang.reflect.Method.invoke(Method.java:597)
at org.testng.internal.MethodInvocationHelper.invokeMethod(MethodInvocationHelper.java:80)
at org.testng.internal.Invoker.invokeMethod(Invoker.java:701)
... 15 more
testTemplateBuilderCannotFind(org.jclouds.openhosting.compute.OpenHostingEast1TemplateBuilderLiveTest) Time elapsed: 0.046 sec <<< FAILURE!
org.testng.TestException:
Expected exception java.util.NoSuchElementException but got java.lang.ClassCastException: org.jclouds.elasticstack.domain.DriveInfo cannot be cast to java.lang.Comparable
at org.testng.internal.Invoker.handleInvocationResults(Invoker.java:1475)
at org.testng.internal.Invoker.invokeMethod(Invoker.java:750)
at org.testng.internal.Invoker.invokeTestMethod(Invoker.java:893)
at org.testng.internal.Invoker.invokeTestMethods(Invoker.java:1218)
at org.testng.internal.TestMethodWorker.invokeTestMethods(TestMethodWorker.java:127)
at org.testng.internal.TestMethodWorker.run(TestMethodWorker.java:111)
at org.testng.TestRunner.privateRun(TestRunner.java:758)
at org.testng.TestRunner.run(TestRunner.java:613)
at org.testng.SuiteRunner.runTest(SuiteRunner.java:334)
at org.testng.SuiteRunner.access$000(SuiteRunner.java:37)
at org.testng.SuiteRunner$SuiteWorker.run(SuiteRunner.java:368)
at org.testng.internal.thread.ThreadUtil$2.call(ThreadUtil.java:64)
at java.util.concurrent.FutureTask$Sync.innerRun(FutureTask.java:303)
at java.util.concurrent.FutureTask.run(FutureTask.java:138)
at java.util.concurrent.ThreadPoolExecutor$Worker.runTask(ThreadPoolExecutor.java:886)
at java.util.concurrent.ThreadPoolExecutor$Worker.run(ThreadPoolExecutor.java:908)
at java.lang.Thread.run(Thread.java:680)
Caused by: java.lang.ClassCastException: org.jclouds.elasticstack.domain.DriveInfo cannot be cast to java.lang.Comparable
at com.google.common.collect.NaturalOrdering.compare(NaturalOrdering.java:28)
at java.util.Arrays.mergeSort(Arrays.java:1270)
at java.util.Arrays.mergeSort(Arrays.java:1281)
at java.util.Arrays.sort(Arrays.java:1210)
at com.google.common.collect.SortedIterables.sortedUnique(SortedIterables.java:95)
at com.google.common.collect.ImmutableSortedSet.copyOfInternal(ImmutableSortedSet.java:408)
at com.google.common.collect.ImmutableSortedSet.copyOf(ImmutableSortedSet.java:343)
at com.google.common.collect.ImmutableSortedSet.copyOf(ImmutableSortedSet.java:251)
at org.jclouds.util.Iterables2.concreteCopy(Iterables2.java:37)
at org.jclouds.elasticstack.compute.ElasticStackComputeServiceAdapter.listImages(ElasticStackComputeServiceAdapter.java:187)
at org.jclouds.compute.config.ComputeServiceAdapterContextModule$2.get(ComputeServiceAdapterContextModule.java:116)
at org.jclouds.compute.config.ComputeServiceAdapterContextModule$2.get(ComputeServiceAdapterContextModule.java:112)
at org.jclouds.collect.TransformingSetSupplier.get(TransformingSetSupplier.java:47)
at org.jclouds.collect.TransformingSetSupplier.get(TransformingSetSupplier.java:36)
at org.jclouds.compute.config.BaseComputeServiceContextModule$9.get(BaseComputeServiceContextModule.java:247)
at org.jclouds.compute.config.BaseComputeServiceContextModule$9.get(BaseComputeServiceContextModule.java:244)
at org.jclouds.rest.suppliers.SetAndThrowAuthorizationExceptionSupplier.get(SetAndThrowAuthorizationExceptionSupplier.java:49)
at org.jclouds.concurrent.RetryOnTimeOutExceptionSupplier.get(RetryOnTimeOutExceptionSupplier.java:47)
at org.jclouds.util.Suppliers2$ExpiringMemoizingSupplier.get(Suppliers2.java:130)
at org.jclouds.rest.suppliers.MemoizedRetryOnTimeOutButNotOnAuthorizationExceptionSupplier.get(MemoizedRetryOnTimeOutButNotOnAuthorizationExceptionSupplier.java:64)
at org.jclouds.compute.domain.internal.TemplateBuilderImpl.getImages(TemplateBuilderImpl.java:737)
at org.jclouds.compute.domain.internal.TemplateBuilderImpl.build(TemplateBuilderImpl.java:612)
at org.jclouds.compute.internal.BaseTemplateBuilderLiveTest.testTemplateBuilderCannotFind(BaseTemplateBuilderLiveTest.java:154)
at sun.reflect.NativeMethodAccessorImpl.invoke0(Native Method)
at sun.reflect.NativeMethodAccessorImpl.invoke(NativeMethodAccessorImpl.java:39)
at sun.reflect.DelegatingMethodAccessorImpl.invoke(DelegatingMethodAccessorImpl.java:25)
at java.lang.reflect.Method.invoke(Method.java:597)
at org.testng.internal.MethodInvocationHelper.invokeMethod(MethodInvocationHelper.java:80)
at org.testng.internal.Invoker.invokeMethod(Invoker.java:701)
... 15 more
Caused by: java.lang.ClassCastException: org.jclouds.elasticstack.domain.DriveInfo cannot be cast to java.lang.Comparable
at com.google.common.collect.NaturalOrdering.compare(NaturalOrdering.java:28)
at java.util.Arrays.mergeSort(Arrays.java:1270)
at java.util.Arrays.mergeSort(Arrays.java:1281)
at java.util.Arrays.sort(Arrays.java:1210)
at com.google.common.collect.SortedIterables.sortedUnique(SortedIterables.java:95)
at com.google.common.collect.ImmutableSortedSet.copyOfInternal(ImmutableSortedSet.java:408)
at com.google.common.collect.ImmutableSortedSet.copyOf(ImmutableSortedSet.java:343)
at com.google.common.collect.ImmutableSortedSet.copyOf(ImmutableSortedSet.java:251)
at org.jclouds.util.Iterables2.concreteCopy(Iterables2.java:37)
at org.jclouds.elasticstack.compute.ElasticStackComputeServiceAdapter.listImages(ElasticStackComputeServiceAdapter.java:187)
at org.jclouds.compute.config.ComputeServiceAdapterContextModule$2.get(ComputeServiceAdapterContextModule.java:116)
at org.jclouds.compute.config.ComputeServiceAdapterContextModule$2.get(ComputeServiceAdapterContextModule.java:112)
at org.jclouds.collect.TransformingSetSupplier.get(TransformingSetSupplier.java:47)
at org.jclouds.collect.TransformingSetSupplier.get(TransformingSetSupplier.java:36)
at org.jclouds.compute.config.BaseComputeServiceContextModule$9.get(BaseComputeServiceContextModule.java:247)
at org.jclouds.compute.config.BaseComputeServiceContextModule$9.get(BaseComputeServiceContextModule.java:244)
at org.jclouds.rest.suppliers.SetAndThrowAuthorizationExceptionSupplier.get(SetAndThrowAuthorizationExceptionSupplier.java:49)
at org.jclouds.concurrent.RetryOnTimeOutExceptionSupplier.get(RetryOnTimeOutExceptionSupplier.java:47)
at org.jclouds.util.Suppliers2$ExpiringMemoizingSupplier.get(Suppliers2.java:130)
at org.jclouds.rest.suppliers.MemoizedRetryOnTimeOutButNotOnAuthorizationExceptionSupplier.get(MemoizedRetryOnTimeOutButNotOnAuthorizationExceptionSupplier.java:64)
at org.jclouds.compute.domain.internal.TemplateBuilderImpl.getImages(TemplateBuilderImpl.java:737)
at org.jclouds.compute.domain.internal.TemplateBuilderImpl.build(TemplateBuilderImpl.java:612)
at org.jclouds.compute.internal.BaseTemplateBuilderLiveTest.testTemplateBuilderCannotFind(BaseTemplateBuilderLiveTest.java:154)
at sun.reflect.NativeMethodAccessorImpl.invoke0(Native Method)
at sun.reflect.NativeMethodAccessorImpl.invoke(NativeMethodAccessorImpl.java:39)
at sun.reflect.DelegatingMethodAccessorImpl.invoke(DelegatingMethodAccessorImpl.java:25)
at java.lang.reflect.Method.invoke(Method.java:597)
at org.testng.internal.MethodInvocationHelper.invokeMethod(MethodInvocationHelper.java:80)
at org.testng.internal.Invoker.invokeMethod(Invoker.java:701)
... 15 more
testTemplateBuilderCannotFind(org.jclouds.openhosting.compute.OpenHostingEast1TemplateBuilderLiveTest) Time elapsed: 0.002 sec <<< FAILURE!
org.testng.TestException:
Expected exception java.util.NoSuchElementException but got java.lang.ClassCastException: org.jclouds.elasticstack.domain.DriveInfo cannot be cast to java.lang.Comparable
at org.testng.internal.Invoker.handleInvocationResults(Invoker.java:1475)
at org.testng.internal.Invoker.invokeMethod(Invoker.java:750)
at org.testng.internal.Invoker.invokeTestMethod(Invoker.java:893)
at org.testng.internal.Invoker.invokeTestMethods(Invoker.java:1218)
at org.testng.internal.TestMethodWorker.invokeTestMethods(TestMethodWorker.java:127)
at org.testng.internal.TestMethodWorker.run(TestMethodWorker.java:111)
at org.testng.TestRunner.privateRun(TestRunner.java:758)
at org.testng.TestRunner.run(TestRunner.java:613)
at org.testng.SuiteRunner.runTest(SuiteRunner.java:334)
at org.testng.SuiteRunner.access$000(SuiteRunner.java:37)
at org.testng.SuiteRunner$SuiteWorker.run(SuiteRunner.java:368)
at org.testng.internal.thread.ThreadUtil$2.call(ThreadUtil.java:64)
at java.util.concurrent.FutureTask$Sync.innerRun(FutureTask.java:303)
at java.util.concurrent.FutureTask.run(FutureTask.java:138)
at java.util.concurrent.ThreadPoolExecutor$Worker.runTask(ThreadPoolExecutor.java:886)
at java.util.concurrent.ThreadPoolExecutor$Worker.run(ThreadPoolExecutor.java:908)
at java.lang.Thread.run(Thread.java:680)
Caused by: java.lang.ClassCastException: org.jclouds.elasticstack.domain.DriveInfo cannot be cast to java.lang.Comparable
at com.google.common.collect.NaturalOrdering.compare(NaturalOrdering.java:28)
at java.util.Arrays.mergeSort(Arrays.java:1270)
at java.util.Arrays.mergeSort(Arrays.java:1281)
at java.util.Arrays.sort(Arrays.java:1210)
at com.google.common.collect.SortedIterables.sortedUnique(SortedIterables.java:95)
at com.google.common.collect.ImmutableSortedSet.copyOfInternal(ImmutableSortedSet.java:408)
at com.google.common.collect.ImmutableSortedSet.copyOf(ImmutableSortedSet.java:343)
at com.google.common.collect.ImmutableSortedSet.copyOf(ImmutableSortedSet.java:251)
at org.jclouds.util.Iterables2.concreteCopy(Iterables2.java:37)
at org.jclouds.elasticstack.compute.ElasticStackComputeServiceAdapter.listImages(ElasticStackComputeServiceAdapter.java:187)
at org.jclouds.compute.config.ComputeServiceAdapterContextModule$2.get(ComputeServiceAdapterContextModule.java:116)
at org.jclouds.compute.config.ComputeServiceAdapterContextModule$2.get(ComputeServiceAdapterContextModule.java:112)
at org.jclouds.collect.TransformingSetSupplier.get(TransformingSetSupplier.java:47)
at org.jclouds.collect.TransformingSetSupplier.get(TransformingSetSupplier.java:36)
at org.jclouds.compute.config.BaseComputeServiceContextModule$9.get(BaseComputeServiceContextModule.java:247)
at org.jclouds.compute.config.BaseComputeServiceContextModule$9.get(BaseComputeServiceContextModule.java:244)
at org.jclouds.rest.suppliers.SetAndThrowAuthorizationExceptionSupplier.get(SetAndThrowAuthorizationExceptionSupplier.java:49)
at org.jclouds.concurrent.RetryOnTimeOutExceptionSupplier.get(RetryOnTimeOutExceptionSupplier.java:47)
at org.jclouds.util.Suppliers2$ExpiringMemoizingSupplier.get(Suppliers2.java:130)
at org.jclouds.rest.suppliers.MemoizedRetryOnTimeOutButNotOnAuthorizationExceptionSupplier.get(MemoizedRetryOnTimeOutButNotOnAuthorizationExceptionSupplier.java:64)
at org.jclouds.compute.domain.internal.TemplateBuilderImpl.getImages(TemplateBuilderImpl.java:737)
at org.jclouds.compute.domain.internal.TemplateBuilderImpl.build(TemplateBuilderImpl.java:612)
at org.jclouds.compute.internal.BaseTemplateBuilderLiveTest.testTemplateBuilderCannotFind(BaseTemplateBuilderLiveTest.java:154)
at sun.reflect.NativeMethodAccessorImpl.invoke0(Native Method)
at sun.reflect.NativeMethodAccessorImpl.invoke(NativeMethodAccessorImpl.java:39)
at sun.reflect.DelegatingMethodAccessorImpl.invoke(DelegatingMethodAccessorImpl.java:25)
at java.lang.reflect.Method.invoke(Method.java:597)
at org.testng.internal.MethodInvocationHelper.invokeMethod(MethodInvocationHelper.java:80)
at org.testng.internal.Invoker.invokeMethod(Invoker.java:701)
... 15 more
Caused by: java.lang.ClassCastException: org.jclouds.elasticstack.domain.DriveInfo cannot be cast to java.lang.Comparable
at com.google.common.collect.NaturalOrdering.compare(NaturalOrdering.java:28)
at java.util.Arrays.mergeSort(Arrays.java:1270)
at java.util.Arrays.mergeSort(Arrays.java:1281)
at java.util.Arrays.sort(Arrays.java:1210)
at com.google.common.collect.SortedIterables.sortedUnique(SortedIterables.java:95)
at com.google.common.collect.ImmutableSortedSet.copyOfInternal(ImmutableSortedSet.java:408)
at com.google.common.collect.ImmutableSortedSet.copyOf(ImmutableSortedSet.java:343)
at com.google.common.collect.ImmutableSortedSet.copyOf(ImmutableSortedSet.java:251)
at org.jclouds.util.Iterables2.concreteCopy(Iterables2.java:37)
at org.jclouds.elasticstack.compute.ElasticStackComputeServiceAdapter.listImages(ElasticStackComputeServiceAdapter.java:187)
at org.jclouds.compute.config.ComputeServiceAdapterContextModule$2.get(ComputeServiceAdapterContextModule.java:116)
at org.jclouds.compute.config.ComputeServiceAdapterContextModule$2.get(ComputeServiceAdapterContextModule.java:112)
at org.jclouds.collect.TransformingSetSupplier.get(TransformingSetSupplier.java:47)
at org.jclouds.collect.TransformingSetSupplier.get(TransformingSetSupplier.java:36)
at org.jclouds.compute.config.BaseComputeServiceContextModule$9.get(BaseComputeServiceContextModule.java:247)
at org.jclouds.compute.config.BaseComputeServiceContextModule$9.get(BaseComputeServiceContextModule.java:244)
at org.jclouds.rest.suppliers.SetAndThrowAuthorizationExceptionSupplier.get(SetAndThrowAuthorizationExceptionSupplier.java:49)
at org.jclouds.concurrent.RetryOnTimeOutExceptionSupplier.get(RetryOnTimeOutExceptionSupplier.java:47)
at org.jclouds.util.Suppliers2$ExpiringMemoizingSupplier.get(Suppliers2.java:130)
at org.jclouds.rest.suppliers.MemoizedRetryOnTimeOutButNotOnAuthorizationExceptionSupplier.get(MemoizedRetryOnTimeOutButNotOnAuthorizationExceptionSupplier.java:64)
at org.jclouds.compute.domain.internal.TemplateBuilderImpl.getImages(TemplateBuilderImpl.java:737)
at org.jclouds.compute.domain.internal.TemplateBuilderImpl.build(TemplateBuilderImpl.java:612)
at org.jclouds.compute.internal.BaseTemplateBuilderLiveTest.testTemplateBuilderCannotFind(BaseTemplateBuilderLiveTest.java:154)
at sun.reflect.NativeMethodAccessorImpl.invoke0(Native Method)
at sun.reflect.NativeMethodAccessorImpl.invoke(NativeMethodAccessorImpl.java:39)
at sun.reflect.DelegatingMethodAccessorImpl.invoke(DelegatingMethodAccessorImpl.java:25)
at java.lang.reflect.Method.invoke(Method.java:597)
at org.testng.internal.MethodInvocationHelper.invokeMethod(MethodInvocationHelper.java:80)
at org.testng.internal.Invoker.invokeMethod(Invoker.java:701)
... 15 more
testTemplateBuilderCannotFind(org.jclouds.openhosting.compute.OpenHostingEast1TemplateBuilderLiveTest) Time elapsed: 0.003 sec <<< FAILURE!
org.testng.TestException:
Expected exception java.util.NoSuchElementException but got java.lang.ClassCastException: org.jclouds.elasticstack.domain.DriveInfo cannot be cast to java.lang.Comparable
at org.testng.internal.Invoker.handleInvocationResults(Invoker.java:1475)
at org.testng.internal.Invoker.invokeMethod(Invoker.java:750)
at org.testng.internal.Invoker.invokeTestMethod(Invoker.java:893)
at org.testng.internal.Invoker.invokeTestMethods(Invoker.java:1218)
at org.testng.internal.TestMethodWorker.invokeTestMethods(TestMethodWorker.java:127)
at org.testng.internal.TestMethodWorker.run(TestMethodWorker.java:111)
at org.testng.TestRunner.privateRun(TestRunner.java:758)
at org.testng.TestRunner.run(TestRunner.java:613)
at org.testng.SuiteRunner.runTest(SuiteRunner.java:334)
at org.testng.SuiteRunner.access$000(SuiteRunner.java:37)
at org.testng.SuiteRunner$SuiteWorker.run(SuiteRunner.java:368)
at org.testng.internal.thread.ThreadUtil$2.call(ThreadUtil.java:64)
at java.util.concurrent.FutureTask$Sync.innerRun(FutureTask.java:303)
at java.util.concurrent.FutureTask.run(FutureTask.java:138)
at java.util.concurrent.ThreadPoolExecutor$Worker.runTask(ThreadPoolExecutor.java:886)
at java.util.concurrent.ThreadPoolExecutor$Worker.run(ThreadPoolExecutor.java:908)
at java.lang.Thread.run(Thread.java:680)
Caused by: java.lang.ClassCastException: org.jclouds.elasticstack.domain.DriveInfo cannot be cast to java.lang.Comparable
at com.google.common.collect.NaturalOrdering.compare(NaturalOrdering.java:28)
at java.util.Arrays.mergeSort(Arrays.java:1270)
at java.util.Arrays.mergeSort(Arrays.java:1281)
at java.util.Arrays.sort(Arrays.java:1210)
at com.google.common.collect.SortedIterables.sortedUnique(SortedIterables.java:95)
at com.google.common.collect.ImmutableSortedSet.copyOfInternal(ImmutableSortedSet.java:408)
at com.google.common.collect.ImmutableSortedSet.copyOf(ImmutableSortedSet.java:343)
at com.google.common.collect.ImmutableSortedSet.copyOf(ImmutableSortedSet.java:251)
at org.jclouds.util.Iterables2.concreteCopy(Iterables2.java:37)
at org.jclouds.elasticstack.compute.ElasticStackComputeServiceAdapter.listImages(ElasticStackComputeServiceAdapter.java:187)
at org.jclouds.compute.config.ComputeServiceAdapterContextModule$2.get(ComputeServiceAdapterContextModule.java:116)
at org.jclouds.compute.config.ComputeServiceAdapterContextModule$2.get(ComputeServiceAdapterContextModule.java:112)
at org.jclouds.collect.TransformingSetSupplier.get(TransformingSetSupplier.java:47)
at org.jclouds.collect.TransformingSetSupplier.get(TransformingSetSupplier.java:36)
at org.jclouds.compute.config.BaseComputeServiceContextModule$9.get(BaseComputeServiceContextModule.java:247)
at org.jclouds.compute.config.BaseComputeServiceContextModule$9.get(BaseComputeServiceContextModule.java:244)
at org.jclouds.rest.suppliers.SetAndThrowAuthorizationExceptionSupplier.get(SetAndThrowAuthorizationExceptionSupplier.java:49)
at org.jclouds.concurrent.RetryOnTimeOutExceptionSupplier.get(RetryOnTimeOutExceptionSupplier.java:47)
at org.jclouds.util.Suppliers2$ExpiringMemoizingSupplier.get(Suppliers2.java:130)
at org.jclouds.rest.suppliers.MemoizedRetryOnTimeOutButNotOnAuthorizationExceptionSupplier.get(MemoizedRetryOnTimeOutButNotOnAuthorizationExceptionSupplier.java:64)
at org.jclouds.compute.domain.internal.TemplateBuilderImpl.getImages(TemplateBuilderImpl.java:737)
at org.jclouds.compute.domain.internal.TemplateBuilderImpl.build(TemplateBuilderImpl.java:612)
at org.jclouds.compute.internal.BaseTemplateBuilderLiveTest.testTemplateBuilderCannotFind(BaseTemplateBuilderLiveTest.java:154)
at sun.reflect.NativeMethodAccessorImpl.invoke0(Native Method)
at sun.reflect.NativeMethodAccessorImpl.invoke(NativeMethodAccessorImpl.java:39)
at sun.reflect.DelegatingMethodAccessorImpl.invoke(DelegatingMethodAccessorImpl.java:25)
at java.lang.reflect.Method.invoke(Method.java:597)
at org.testng.internal.MethodInvocationHelper.invokeMethod(MethodInvocationHelper.java:80)
at org.testng.internal.Invoker.invokeMethod(Invoker.java:701)
... 15 more
Caused by: java.lang.ClassCastException: org.jclouds.elasticstack.domain.DriveInfo cannot be cast to java.lang.Comparable
at com.google.common.collect.NaturalOrdering.compare(NaturalOrdering.java:28)
at java.util.Arrays.mergeSort(Arrays.java:1270)
at java.util.Arrays.mergeSort(Arrays.java:1281)
at java.util.Arrays.sort(Arrays.java:1210)
at com.google.common.collect.SortedIterables.sortedUnique(SortedIterables.java:95)
at com.google.common.collect.ImmutableSortedSet.copyOfInternal(ImmutableSortedSet.java:408)
at com.google.common.collect.ImmutableSortedSet.copyOf(ImmutableSortedSet.java:343)
at com.google.common.collect.ImmutableSortedSet.copyOf(ImmutableSortedSet.java:251)
at org.jclouds.util.Iterables2.concreteCopy(Iterables2.java:37)
at org.jclouds.elasticstack.compute.ElasticStackComputeServiceAdapter.listImages(ElasticStackComputeServiceAdapter.java:187)
at org.jclouds.compute.config.ComputeServiceAdapterContextModule$2.get(ComputeServiceAdapterContextModule.java:116)
at org.jclouds.compute.config.ComputeServiceAdapterContextModule$2.get(ComputeServiceAdapterContextModule.java:112)
at org.jclouds.collect.TransformingSetSupplier.get(TransformingSetSupplier.java:47)
at org.jclouds.collect.TransformingSetSupplier.get(TransformingSetSupplier.java:36)
at org.jclouds.compute.config.BaseComputeServiceContextModule$9.get(BaseComputeServiceContextModule.java:247)
at org.jclouds.compute.config.BaseComputeServiceContextModule$9.get(BaseComputeServiceContextModule.java:244)
at org.jclouds.rest.suppliers.SetAndThrowAuthorizationExceptionSupplier.get(SetAndThrowAuthorizationExceptionSupplier.java:49)
at org.jclouds.concurrent.RetryOnTimeOutExceptionSupplier.get(RetryOnTimeOutExceptionSupplier.java:47)
at org.jclouds.util.Suppliers2$ExpiringMemoizingSupplier.get(Suppliers2.java:130)
at org.jclouds.rest.suppliers.MemoizedRetryOnTimeOutButNotOnAuthorizationExceptionSupplier.get(MemoizedRetryOnTimeOutButNotOnAuthorizationExceptionSupplier.java:64)
at org.jclouds.compute.domain.internal.TemplateBuilderImpl.getImages(TemplateBuilderImpl.java:737)
at org.jclouds.compute.domain.internal.TemplateBuilderImpl.build(TemplateBuilderImpl.java:612)
at org.jclouds.compute.internal.BaseTemplateBuilderLiveTest.testTemplateBuilderCannotFind(BaseTemplateBuilderLiveTest.java:154)
at sun.reflect.NativeMethodAccessorImpl.invoke0(Native Method)
at sun.reflect.NativeMethodAccessorImpl.invoke(NativeMethodAccessorImpl.java:39)
at sun.reflect.DelegatingMethodAccessorImpl.invoke(DelegatingMethodAccessorImpl.java:25)
at java.lang.reflect.Method.invoke(Method.java:597)
at org.testng.internal.MethodInvocationHelper.invokeMethod(MethodInvocationHelper.java:80)
at org.testng.internal.Invoker.invokeMethod(Invoker.java:701)
... 15 more
testTemplateBuilderCannotFind(org.jclouds.openhosting.compute.OpenHostingEast1TemplateBuilderLiveTest) Time elapsed: 0.003 sec <<< FAILURE!
org.testng.TestException:
Expected exception java.util.NoSuchElementException but got java.lang.ClassCastException: org.jclouds.elasticstack.domain.DriveInfo cannot be cast to java.lang.Comparable
at org.testng.internal.Invoker.handleInvocationResults(Invoker.java:1475)
at org.testng.internal.Invoker.invokeMethod(Invoker.java:750)
at org.testng.internal.Invoker.invokeTestMethod(Invoker.java:893)
at org.testng.internal.Invoker.invokeTestMethods(Invoker.java:1218)
at org.testng.internal.TestMethodWorker.invokeTestMethods(TestMethodWorker.java:127)
at org.testng.internal.TestMethodWorker.run(TestMethodWorker.java:111)
at org.testng.TestRunner.privateRun(TestRunner.java:758)
at org.testng.TestRunner.run(TestRunner.java:613)
at org.testng.SuiteRunner.runTest(SuiteRunner.java:334)
at org.testng.SuiteRunner.access$000(SuiteRunner.java:37)
at org.testng.SuiteRunner$SuiteWorker.run(SuiteRunner.java:368)
at org.testng.internal.thread.ThreadUtil$2.call(ThreadUtil.java:64)
at java.util.concurrent.FutureTask$Sync.innerRun(FutureTask.java:303)
at java.util.concurrent.FutureTask.run(FutureTask.java:138)
at java.util.concurrent.ThreadPoolExecutor$Worker.runTask(ThreadPoolExecutor.java:886)
at java.util.concurrent.ThreadPoolExecutor$Worker.run(ThreadPoolExecutor.java:908)
at java.lang.Thread.run(Thread.java:680)
Caused by: java.lang.ClassCastException: org.jclouds.elasticstack.domain.DriveInfo cannot be cast to java.lang.Comparable
at com.google.common.collect.NaturalOrdering.compare(NaturalOrdering.java:28)
at java.util.Arrays.mergeSort(Arrays.java:1270)
at java.util.Arrays.mergeSort(Arrays.java:1281)
at java.util.Arrays.sort(Arrays.java:1210)
at com.google.common.collect.SortedIterables.sortedUnique(SortedIterables.java:95)
at com.google.common.collect.ImmutableSortedSet.copyOfInternal(ImmutableSortedSet.java:408)
at com.google.common.collect.ImmutableSortedSet.copyOf(ImmutableSortedSet.java:343)
at com.google.common.collect.ImmutableSortedSet.copyOf(ImmutableSortedSet.java:251)
at org.jclouds.util.Iterables2.concreteCopy(Iterables2.java:37)
at org.jclouds.elasticstack.compute.ElasticStackComputeServiceAdapter.listImages(ElasticStackComputeServiceAdapter.java:187)
at org.jclouds.compute.config.ComputeServiceAdapterContextModule$2.get(ComputeServiceAdapterContextModule.java:116)
at org.jclouds.compute.config.ComputeServiceAdapterContextModule$2.get(ComputeServiceAdapterContextModule.java:112)
at org.jclouds.collect.TransformingSetSupplier.get(TransformingSetSupplier.java:47)
at org.jclouds.collect.TransformingSetSupplier.get(TransformingSetSupplier.java:36)
at org.jclouds.compute.config.BaseComputeServiceContextModule$9.get(BaseComputeServiceContextModule.java:247)
at org.jclouds.compute.config.BaseComputeServiceContextModule$9.get(BaseComputeServiceContextModule.java:244)
at org.jclouds.rest.suppliers.SetAndThrowAuthorizationExceptionSupplier.get(SetAndThrowAuthorizationExceptionSupplier.java:49)
at org.jclouds.concurrent.RetryOnTimeOutExceptionSupplier.get(RetryOnTimeOutExceptionSupplier.java:47)
at org.jclouds.util.Suppliers2$ExpiringMemoizingSupplier.get(Suppliers2.java:130)
at org.jclouds.rest.suppliers.MemoizedRetryOnTimeOutButNotOnAuthorizationExceptionSupplier.get(MemoizedRetryOnTimeOutButNotOnAuthorizationExceptionSupplier.java:64)
at org.jclouds.compute.domain.internal.TemplateBuilderImpl.getImages(TemplateBuilderImpl.java:737)
at org.jclouds.compute.domain.internal.TemplateBuilderImpl.build(TemplateBuilderImpl.java:612)
at org.jclouds.compute.internal.BaseTemplateBuilderLiveTest.testTemplateBuilderCannotFind(BaseTemplateBuilderLiveTest.java:154)
at sun.reflect.NativeMethodAccessorImpl.invoke0(Native Method)
at sun.reflect.NativeMethodAccessorImpl.invoke(NativeMethodAccessorImpl.java:39)
at sun.reflect.DelegatingMethodAccessorImpl.invoke(DelegatingMethodAccessorImpl.java:25)
at java.lang.reflect.Method.invoke(Method.java:597)
at org.testng.internal.MethodInvocationHelper.invokeMethod(MethodInvocationHelper.java:80)
at org.testng.internal.Invoker.invokeMethod(Invoker.java:701)
... 15 more
Caused by: java.lang.ClassCastException: org.jclouds.elasticstack.domain.DriveInfo cannot be cast to java.lang.Comparable
at com.google.common.collect.NaturalOrdering.compare(NaturalOrdering.java:28)
at java.util.Arrays.mergeSort(Arrays.java:1270)
at java.util.Arrays.mergeSort(Arrays.java:1281)
at java.util.Arrays.sort(Arrays.java:1210)
at com.google.common.collect.SortedIterables.sortedUnique(SortedIterables.java:95)
at com.google.common.collect.ImmutableSortedSet.copyOfInternal(ImmutableSortedSet.java:408)
at com.google.common.collect.ImmutableSortedSet.copyOf(ImmutableSortedSet.java:343)
at com.google.common.collect.ImmutableSortedSet.copyOf(ImmutableSortedSet.java:251)
at org.jclouds.util.Iterables2.concreteCopy(Iterables2.java:37)
at org.jclouds.elasticstack.compute.ElasticStackComputeServiceAdapter.listImages(ElasticStackComputeServiceAdapter.java:187)
at org.jclouds.compute.config.ComputeServiceAdapterContextModule$2.get(ComputeServiceAdapterContextModule.java:116)
at org.jclouds.compute.config.ComputeServiceAdapterContextModule$2.get(ComputeServiceAdapterContextModule.java:112)
at org.jclouds.collect.TransformingSetSupplier.get(TransformingSetSupplier.java:47)
at org.jclouds.collect.TransformingSetSupplier.get(TransformingSetSupplier.java:36)
at org.jclouds.compute.config.BaseComputeServiceContextModule$9.get(BaseComputeServiceContextModule.java:247)
at org.jclouds.compute.config.BaseComputeServiceContextModule$9.get(BaseComputeServiceContextModule.java:244)
at org.jclouds.rest.suppliers.SetAndThrowAuthorizationExceptionSupplier.get(SetAndThrowAuthorizationExceptionSupplier.java:49)
at org.jclouds.concurrent.RetryOnTimeOutExceptionSupplier.get(RetryOnTimeOutExceptionSupplier.java:47)
at org.jclouds.util.Suppliers2$ExpiringMemoizingSupplier.get(Suppliers2.java:130)
at org.jclouds.rest.suppliers.MemoizedRetryOnTimeOutButNotOnAuthorizationExceptionSupplier.get(MemoizedRetryOnTimeOutButNotOnAuthorizationExceptionSupplier.java:64)
at org.jclouds.compute.domain.internal.TemplateBuilderImpl.getImages(TemplateBuilderImpl.java:737)
at org.jclouds.compute.domain.internal.TemplateBuilderImpl.build(TemplateBuilderImpl.java:612)
at org.jclouds.compute.internal.BaseTemplateBuilderLiveTest.testTemplateBuilderCannotFind(BaseTemplateBuilderLiveTest.java:154)
at sun.reflect.NativeMethodAccessorImpl.invoke0(Native Method)
at sun.reflect.NativeMethodAccessorImpl.invoke(NativeMethodAccessorImpl.java:39)
at sun.reflect.DelegatingMethodAccessorImpl.invoke(DelegatingMethodAccessorImpl.java:25)
at java.lang.reflect.Method.invoke(Method.java:597)
at org.testng.internal.MethodInvocationHelper.invokeMethod(MethodInvocationHelper.java:80)
at org.testng.internal.Invoker.invokeMethod(Invoker.java:701)
... 15 more
testTemplateBuilderCannotFind(org.jclouds.openhosting.compute.OpenHostingEast1TemplateBuilderLiveTest) Time elapsed: 0.005 sec <<< FAILURE!
org.testng.TestException:
Expected exception java.util.NoSuchElementException but got java.lang.ClassCastException: org.jclouds.elasticstack.domain.DriveInfo cannot be cast to java.lang.Comparable
at org.testng.internal.Invoker.handleInvocationResults(Invoker.java:1475)
at org.testng.internal.Invoker.invokeMethod(Invoker.java:750)
at org.testng.internal.Invoker.invokeTestMethod(Invoker.java:893)
at org.testng.internal.Invoker.invokeTestMethods(Invoker.java:1218)
at org.testng.internal.TestMethodWorker.invokeTestMethods(TestMethodWorker.java:127)
at org.testng.internal.TestMethodWorker.run(TestMethodWorker.java:111)
at org.testng.TestRunner.privateRun(TestRunner.java:758)
at org.testng.TestRunner.run(TestRunner.java:613)
at org.testng.SuiteRunner.runTest(SuiteRunner.java:334)
at org.testng.SuiteRunner.access$000(SuiteRunner.java:37)
at org.testng.SuiteRunner$SuiteWorker.run(SuiteRunner.java:368)
at org.testng.internal.thread.ThreadUtil$2.call(ThreadUtil.java:64)
at java.util.concurrent.FutureTask$Sync.innerRun(FutureTask.java:303)
at java.util.concurrent.FutureTask.run(FutureTask.java:138)
at java.util.concurrent.ThreadPoolExecutor$Worker.runTask(ThreadPoolExecutor.java:886)