blob: c523d18aa9b70f6ff30b40c5df23505f98f255a1 [file] [log] [blame]
[INFO] Scanning for projects...
[WARNING]
[WARNING] Some problems were encountered while building the effective model for org.jclouds.provider:savvis-symphonyvpdc:bundle:1.3.0-SNAPSHOT
[WARNING] 'parent.relativePath' of POM org.jclouds:jclouds-project:1.3.0-SNAPSHOT (/Users/adriancole/workspace/git/jclouds/project/pom.xml) points at org.jclouds:jclouds-multi instead of org.sonatype.oss:oss-parent, please verify your project structure @ org.jclouds:jclouds-project:1.3.0-SNAPSHOT, /Users/adriancole/workspace/git/jclouds/project/pom.xml, line 24, column 13
[WARNING]
[WARNING] It is highly recommended to fix these problems because they threaten the stability of your build.
[WARNING]
[WARNING] For this reason, future Maven versions might no longer support building such malformed projects.
[WARNING]
[INFO]
[INFO] ------------------------------------------------------------------------
[INFO] Building jclouds savvis-vpdc vpdc 1.3.0-SNAPSHOT
[INFO] ------------------------------------------------------------------------
[INFO]
[INFO] --- maven-clean-plugin:2.4.1:clean (default-clean) @ savvis-symphonyvpdc ---
[INFO] Deleting /Users/adriancole/workspace/git/jclouds/providers/savvis-symphonyvpdc/target
[INFO]
[INFO] --- maven-enforcer-plugin:1.0.1:enforce (enforce-maven) @ savvis-symphonyvpdc ---
[INFO]
[INFO] --- maven-enforcer-plugin:1.0.1:enforce (enforce-banned-dependencies) @ savvis-symphonyvpdc ---
[INFO]
[INFO] --- maven-enforcer-plugin:1.0.1:enforce (enforce-java) @ savvis-symphonyvpdc ---
[INFO]
[INFO] --- maven-remote-resources-plugin:1.2:process (process-remote-resources) @ savvis-symphonyvpdc ---
[INFO] Setting property: classpath.resource.loader.class => 'org.codehaus.plexus.velocity.ContextClassLoaderResourceLoader'.
[INFO] Setting property: velocimacro.messages.on => 'false'.
[INFO] Setting property: resource.loader => 'classpath'.
[INFO] Setting property: resource.manager.logwhenfound => 'false'.
[INFO]
[INFO] --- maven-resources-plugin:2.4.2:resources (default-resources) @ savvis-symphonyvpdc ---
[INFO] Using 'UTF-8' encoding to copy filtered resources.
[INFO] skip non existing resourceDirectory /Users/adriancole/workspace/git/jclouds/providers/savvis-symphonyvpdc/src/main/clojure
[INFO] Copying 2 resources
[INFO] Copying 2 resources
[INFO]
[INFO] --- maven-compiler-plugin:2.3:compile (default-compile) @ savvis-symphonyvpdc ---
[INFO] Compiling 70 source files to /Users/adriancole/workspace/git/jclouds/providers/savvis-symphonyvpdc/target/classes
[INFO]
[INFO] --- maven-resources-plugin:2.4.2:testResources (default-testResources) @ savvis-symphonyvpdc ---
[INFO] Using 'UTF-8' encoding to copy filtered resources.
[INFO] skip non existing resourceDirectory /Users/adriancole/workspace/git/jclouds/providers/savvis-symphonyvpdc/src/test/clojure
[INFO] Copying 30 resources
[INFO] Copying 2 resources
[INFO]
[INFO] --- maven-compiler-plugin:2.3:testCompile (default-testCompile) @ savvis-symphonyvpdc ---
[INFO] Compiling 29 source files to /Users/adriancole/workspace/git/jclouds/providers/savvis-symphonyvpdc/target/test-classes
[INFO]
[INFO] --- maven-surefire-plugin:2.10:test (default-test) @ savvis-symphonyvpdc ---
[INFO] Surefire report directory: /Users/adriancole/workspace/git/jclouds/providers/savvis-symphonyvpdc/target/surefire-reports
[INFO] Using configured provider org.apache.maven.surefire.testng.TestNGProvider
-------------------------------------------------------
T E S T S
-------------------------------------------------------
Running TestSuite
Starting test testRemoveVM(org.jclouds.savvis.vpdc.features.VMAsyncClientTest)
Starting test testAddVMIntoVDCURI(org.jclouds.savvis.vpdc.features.VMAsyncClientTest)
Starting test testCloneVApp(org.jclouds.savvis.vpdc.features.VMAsyncClientTest)
Starting test testPowerOnVM(org.jclouds.savvis.vpdc.features.VMAsyncClientTest)
Starting test testPowerOffVM(org.jclouds.savvis.vpdc.features.VMAsyncClientTest)
[pool-2-thread-3] Test testPowerOnVM(org.jclouds.savvis.vpdc.features.VMAsyncClientTest) succeeded: 122ms
Test suite progress: tests succeeded: 1, failed: 0, skipped: 0.
Starting test testAddMultipleVMsIntoVDCURI(org.jclouds.savvis.vpdc.features.VMAsyncClientTest)
[pool-2-thread-5] Test testRemoveVM(org.jclouds.savvis.vpdc.features.VMAsyncClientTest) succeeded: 135ms
Test suite progress: tests succeeded: 2, failed: 0, skipped: 0.
Starting test testRemoveVMFromVDC(org.jclouds.savvis.vpdc.features.VMAsyncClientTest)
[pool-2-thread-2] Test testPowerOffVM(org.jclouds.savvis.vpdc.features.VMAsyncClientTest) succeeded: 129ms
Test suite progress: tests succeeded: 3, failed: 0, skipped: 0.
Starting test testAddMultipleVMsIntoVDC(org.jclouds.savvis.vpdc.features.VMAsyncClientTest)
[pool-2-thread-5] Test testRemoveVMFromVDC(org.jclouds.savvis.vpdc.features.VMAsyncClientTest) succeeded: 27ms
Test suite progress: tests succeeded: 4, failed: 0, skipped: 0.
Starting test testCaptureVApp(org.jclouds.savvis.vpdc.features.VMAsyncClientTest)
[pool-2-thread-5] Test testCaptureVApp(org.jclouds.savvis.vpdc.features.VMAsyncClientTest) succeeded: 28ms
Test suite progress: tests succeeded: 5, failed: 0, skipped: 0.
Starting test testAddVMIntoVDC(org.jclouds.savvis.vpdc.features.VMAsyncClientTest)
[pool-2-thread-2] Test testAddMultipleVMsIntoVDC(org.jclouds.savvis.vpdc.features.VMAsyncClientTest) succeeded: 63ms
Test suite progress: tests succeeded: 6, failed: 0, skipped: 0.
[pool-2-thread-1] Test testCloneVApp(org.jclouds.savvis.vpdc.features.VMAsyncClientTest) succeeded: 210ms
Test suite progress: tests succeeded: 7, failed: 0, skipped: 0.
[pool-2-thread-5] Test testAddVMIntoVDC(org.jclouds.savvis.vpdc.features.VMAsyncClientTest) succeeded: 19ms
Test suite progress: tests succeeded: 8, failed: 0, skipped: 0.
[pool-2-thread-3] Test testAddMultipleVMsIntoVDCURI(org.jclouds.savvis.vpdc.features.VMAsyncClientTest) succeeded: 82ms
Test suite progress: tests succeeded: 9, failed: 0, skipped: 0.
[pool-2-thread-4] Test testAddVMIntoVDCURI(org.jclouds.savvis.vpdc.features.VMAsyncClientTest) succeeded: 216ms
Test suite progress: tests succeeded: 10, failed: 0, skipped: 0.
Starting test testNetworkWhenOrgNull(org.jclouds.savvis.vpdc.features.BrowsingAsyncClientTest)
Starting test testOrgNull(org.jclouds.savvis.vpdc.features.BrowsingAsyncClientTest)
Starting test testVDCWhenOrgNull(org.jclouds.savvis.vpdc.features.BrowsingAsyncClientTest)
Starting test testVMWithPowerState(org.jclouds.savvis.vpdc.features.BrowsingAsyncClientTest)
Starting test testVMVDC(org.jclouds.savvis.vpdc.features.BrowsingAsyncClientTest)
[pool-2-thread-1] Test testVMVDC(org.jclouds.savvis.vpdc.features.BrowsingAsyncClientTest) succeeded: 135ms
Test suite progress: tests succeeded: 11, failed: 0, skipped: 0.
Starting test testVDC(org.jclouds.savvis.vpdc.features.BrowsingAsyncClientTest)
[pool-2-thread-1] Test testVDC(org.jclouds.savvis.vpdc.features.BrowsingAsyncClientTest) succeeded: 7ms
Test suite progress: tests succeeded: 12, failed: 0, skipped: 0.
Starting test testOrg(org.jclouds.savvis.vpdc.features.BrowsingAsyncClientTest)
[pool-2-thread-1] Test testOrg(org.jclouds.savvis.vpdc.features.BrowsingAsyncClientTest) succeeded: 7ms
Test suite progress: tests succeeded: 13, failed: 0, skipped: 0.
Starting test testVMWhenOrgNull(org.jclouds.savvis.vpdc.features.BrowsingAsyncClientTest)
[pool-2-thread-1] Test testVMWhenOrgNull(org.jclouds.savvis.vpdc.features.BrowsingAsyncClientTest) succeeded: 3ms
Test suite progress: tests succeeded: 14, failed: 0, skipped: 0.
Starting test testListFirewallRules(org.jclouds.savvis.vpdc.features.BrowsingAsyncClientTest)
[pool-2-thread-2] Test testNetworkWhenOrgNull(org.jclouds.savvis.vpdc.features.BrowsingAsyncClientTest) succeeded: 198ms
Test suite progress: tests succeeded: 15, failed: 0, skipped: 0.
Starting test testNetwork(org.jclouds.savvis.vpdc.features.BrowsingAsyncClientTest)
[pool-2-thread-2] Test testNetwork(org.jclouds.savvis.vpdc.features.BrowsingAsyncClientTest) succeeded: 2ms
Test suite progress: tests succeeded: 16, failed: 0, skipped: 0.
Starting test testVM(org.jclouds.savvis.vpdc.features.BrowsingAsyncClientTest)
[pool-2-thread-2] Test testVM(org.jclouds.savvis.vpdc.features.BrowsingAsyncClientTest) succeeded: 3ms
Test suite progress: tests succeeded: 17, failed: 0, skipped: 0.
Starting test testGetTask(org.jclouds.savvis.vpdc.features.BrowsingAsyncClientTest)
[pool-2-thread-5] Test testVDCWhenOrgNull(org.jclouds.savvis.vpdc.features.BrowsingAsyncClientTest) succeeded: 200ms
Test suite progress: tests succeeded: 18, failed: 0, skipped: 0.
Starting test test405MakesIllegalArgumentException(org.jclouds.savvis.vpdc.handlers.VPDCErrorHandlerTest)
[pool-2-thread-3] Test testOrgNull(org.jclouds.savvis.vpdc.features.BrowsingAsyncClientTest) succeeded: 203ms
Test suite progress: tests succeeded: 19, failed: 0, skipped: 0.
Starting test test403MakesAuthorizationException(org.jclouds.savvis.vpdc.handlers.VPDCErrorHandlerTest)
[pool-2-thread-4] Test testVMWithPowerState(org.jclouds.savvis.vpdc.features.BrowsingAsyncClientTest) succeeded: 202ms
Test suite progress: tests succeeded: 20, failed: 0, skipped: 0.
Starting test test400MakesIllegalArgumentException(org.jclouds.savvis.vpdc.handlers.VPDCErrorHandlerTest)
[pool-2-thread-1] Test testListFirewallRules(org.jclouds.savvis.vpdc.features.BrowsingAsyncClientTest) succeeded: 41ms
Test suite progress: tests succeeded: 21, failed: 0, skipped: 0.
Starting test test409MakesIllegalStateException(org.jclouds.savvis.vpdc.handlers.VPDCErrorHandlerTest)
[pool-2-thread-2] Test testGetTask(org.jclouds.savvis.vpdc.features.BrowsingAsyncClientTest) succeeded: 34ms
Test suite progress: tests succeeded: 22, failed: 0, skipped: 0.
Starting test test404MakesResourceNotFoundException(org.jclouds.savvis.vpdc.handlers.VPDCErrorHandlerTest)
[pool-2-thread-3] Test test403MakesAuthorizationException(org.jclouds.savvis.vpdc.handlers.VPDCErrorHandlerTest) succeeded: 76ms
Test suite progress: tests succeeded: 23, failed: 0, skipped: 0.
Starting test test401MakesAuthorizationException(org.jclouds.savvis.vpdc.handlers.VPDCErrorHandlerTest)
[pool-2-thread-3] Test test401MakesAuthorizationException(org.jclouds.savvis.vpdc.handlers.VPDCErrorHandlerTest) succeeded: 1ms
Test suite progress: tests succeeded: 24, failed: 0, skipped: 0.
Starting test testSavvis(org.jclouds.savvis.vpdc.xml.OrgListHandlerTest)
[pool-2-thread-3] Test testSavvis(org.jclouds.savvis.vpdc.xml.OrgListHandlerTest) succeeded: 11ms
Test suite progress: tests succeeded: 25, failed: 0, skipped: 0.
[pool-2-thread-1] Test test409MakesIllegalStateException(org.jclouds.savvis.vpdc.handlers.VPDCErrorHandlerTest) succeeded: 72ms
Test suite progress: tests succeeded: 26, failed: 0, skipped: 0.
[pool-2-thread-5] Test test405MakesIllegalArgumentException(org.jclouds.savvis.vpdc.handlers.VPDCErrorHandlerTest) succeeded: 106ms
Test suite progress: tests succeeded: 27, failed: 0, skipped: 0.
[pool-2-thread-4] Test test400MakesIllegalArgumentException(org.jclouds.savvis.vpdc.handlers.VPDCErrorHandlerTest) succeeded: 106ms
Test suite progress: tests succeeded: 28, failed: 0, skipped: 0.
[pool-2-thread-2] Test test404MakesResourceNotFoundException(org.jclouds.savvis.vpdc.handlers.VPDCErrorHandlerTest) succeeded: 86ms
Test suite progress: tests succeeded: 29, failed: 0, skipped: 0.
Starting test test(org.jclouds.savvis.vpdc.binders.BindVMSpecsToXmlPayloadTest)
[pool-2-thread-2] Test test(org.jclouds.savvis.vpdc.binders.BindVMSpecsToXmlPayloadTest) succeeded: 5ms
Test suite progress: tests succeeded: 30, failed: 0, skipped: 0.
Starting test testPowerOffVMVDC(org.jclouds.savvis.vpdc.features.ServiceManagementAsyncClientTest)
Starting test testPowerOffVM(org.jclouds.savvis.vpdc.features.ServiceManagementAsyncClientTest)
Starting test testPowerOnVM(org.jclouds.savvis.vpdc.features.ServiceManagementAsyncClientTest)
[pool-2-thread-5] Test testPowerOnVM(org.jclouds.savvis.vpdc.features.ServiceManagementAsyncClientTest) succeeded: 3ms
Test suite progress: tests succeeded: 31, failed: 0, skipped: 0.
[pool-2-thread-4] Test testPowerOffVM(org.jclouds.savvis.vpdc.features.ServiceManagementAsyncClientTest) succeeded: 6ms
Test suite progress: tests succeeded: 32, failed: 0, skipped: 0.
Starting test test(org.jclouds.savvis.vpdc.binders.BindFirewallRuleToXmlPayloadTest)
[pool-2-thread-1] Test testPowerOffVMVDC(org.jclouds.savvis.vpdc.features.ServiceManagementAsyncClientTest) succeeded: 12ms
Test suite progress: tests succeeded: 33, failed: 0, skipped: 0.
Starting test test(org.jclouds.savvis.vpdc.xml.VDCHandlerTest)
[pool-2-thread-4] Test test(org.jclouds.savvis.vpdc.binders.BindFirewallRuleToXmlPayloadTest) succeeded: 4ms
Test suite progress: tests succeeded: 34, failed: 0, skipped: 0.
Starting test testSaved(org.jclouds.savvis.vpdc.xml.VDCHandlerTest)
[pool-2-thread-1] Test test(org.jclouds.savvis.vpdc.xml.VDCHandlerTest) succeeded: 6ms
Test suite progress: tests succeeded: 35, failed: 0, skipped: 0.
Starting test test1net(org.jclouds.savvis.vpdc.xml.VDCHandlerTest)
[pool-2-thread-4] Test testSaved(org.jclouds.savvis.vpdc.xml.VDCHandlerTest) succeeded: 8ms
Test suite progress: tests succeeded: 36, failed: 0, skipped: 0.
Starting test testFailed(org.jclouds.savvis.vpdc.xml.VDCHandlerTest)
[pool-2-thread-1] Test test1net(org.jclouds.savvis.vpdc.xml.VDCHandlerTest) succeeded: 15ms
Test suite progress: tests succeeded: 37, failed: 0, skipped: 0.
Starting test test(org.jclouds.savvis.vpdc.xml.FirewallServiceHandlerTest)
[pool-2-thread-4] Test testFailed(org.jclouds.savvis.vpdc.xml.VDCHandlerTest) succeeded: 15ms
Test suite progress: tests succeeded: 38, failed: 0, skipped: 0.
Starting test test(org.jclouds.savvis.vpdc.xml.NetworkHandlerTest)
[pool-2-thread-1] Test test(org.jclouds.savvis.vpdc.xml.FirewallServiceHandlerTest) succeeded: 6ms
Test suite progress: tests succeeded: 39, failed: 0, skipped: 0.
Starting test testNat(org.jclouds.savvis.vpdc.xml.NetworkHandlerTest)
[pool-2-thread-1] Test testNat(org.jclouds.savvis.vpdc.xml.NetworkHandlerTest) succeeded: 5ms
Test suite progress: tests succeeded: 40, failed: 0, skipped: 0.
[pool-2-thread-4] Test test(org.jclouds.savvis.vpdc.xml.NetworkHandlerTest) succeeded: 7ms
Test suite progress: tests succeeded: 41, failed: 0, skipped: 0.
Starting test tesWhenNoVAppsInNetworkSetsAllZerosToGatewayAndNetmask(org.jclouds.savvis.vpdc.xml.NetworkHandlerTest)
Starting test test(org.jclouds.savvis.vpdc.binders.BindCaptureVAppTemplateToXmlPayloadTest)
<?xml version="1.0" encoding="UTF-8" standalone="no"?><CaptureVAppParams xmlns="http://schemas.api.sandbox.symphonyVPDC.savvis.net/vpdci" name="CaptureTemplate"><Description>Save Template</Description><Source href="https://api.symphonyvpdc.savvis.net/vpdc/v1.0/org/100000.0/vdc/2736/vApp/1001"/></CaptureVAppParams>
[pool-2-thread-1] Test tesWhenNoVAppsInNetworkSetsAllZerosToGatewayAndNetmask(org.jclouds.savvis.vpdc.xml.NetworkHandlerTest) succeeded: 3ms
Test suite progress: tests succeeded: 42, failed: 0, skipped: 0.
Starting test test(org.jclouds.savvis.vpdc.xml.NetworkConnectionSectionHandlerTest)
[pool-2-thread-4] Test test(org.jclouds.savvis.vpdc.binders.BindCaptureVAppTemplateToXmlPayloadTest) succeeded: 4ms
Test suite progress: tests succeeded: 43, failed: 0, skipped: 0.
Starting test testApply(org.jclouds.savvis.vpdc.filters.SetVCloudTokenCookieTest)
[pool-2-thread-4] Test testApply(org.jclouds.savvis.vpdc.filters.SetVCloudTokenCookieTest) succeeded: 2ms
Test suite progress: tests succeeded: 44, failed: 0, skipped: 0.
Starting test testSavvis(org.jclouds.savvis.vpdc.xml.OrgHandlerTest)
[pool-2-thread-1] Test test(org.jclouds.savvis.vpdc.xml.NetworkConnectionSectionHandlerTest) succeeded: 7ms
Test suite progress: tests succeeded: 45, failed: 0, skipped: 0.
Starting test testOrgWithoutVDC(org.jclouds.savvis.vpdc.xml.OrgHandlerTest)
[pool-2-thread-4] Test testSavvis(org.jclouds.savvis.vpdc.xml.OrgHandlerTest) succeeded: 3ms
Test suite progress: tests succeeded: 46, failed: 0, skipped: 0.
Starting test test(org.jclouds.savvis.vpdc.xml.NetworkConfigSectionHandlerTest)
[pool-2-thread-1] Test testOrgWithoutVDC(org.jclouds.savvis.vpdc.xml.OrgHandlerTest) succeeded: 3ms
Test suite progress: tests succeeded: 47, failed: 0, skipped: 0.
Starting test testVCloud1_0(org.jclouds.savvis.vpdc.xml.VMHandlerTest)
[pool-2-thread-4] Test test(org.jclouds.savvis.vpdc.xml.NetworkConfigSectionHandlerTest) succeeded: 4ms
Test suite progress: tests succeeded: 48, failed: 0, skipped: 0.
Starting test test(org.jclouds.savvis.vpdc.binders.BindCloneVAppToXmlPayloadTest)
<?xml version="1.0" encoding="UTF-8" standalone="no"?><CloneVAppParams xmlns="http://www.vmware.com/vcloud/v0.8" xmlns:xsi="http://www.w3.org/2001/XMLSchema-instance" deploy="true" name="clonedvm" powerOn="true" xsi:schemaLocation="http://www.vmware.com/vcloud/v0.8 https://api.symphonyvpdc.savvis.net/ns/vcloud.xsd"><Description>VM Tier01</Description><VApp href="https://api.symphonyvpdc.savvis.net/vpdc/v1.0/org/100000.0/vdc/2736/vApp/" type="application/vnd.vmware.vcloud.vApp+xml"/></CloneVAppParams>
[pool-2-thread-4] Test test(org.jclouds.savvis.vpdc.binders.BindCloneVAppToXmlPayloadTest) succeeded: 12ms
Test suite progress: tests succeeded: 49, failed: 0, skipped: 0.
[pool-2-thread-1] Test testVCloud1_0(org.jclouds.savvis.vpdc.xml.VMHandlerTest) succeeded: 23ms
Test suite progress: tests succeeded: 50, failed: 0, skipped: 0.
Starting test testPowerOnVMVDC(org.jclouds.savvis.vpdc.features.ServiceManagementAsyncClientTest)
Starting test testDeleteFirewallRule(org.jclouds.savvis.vpdc.features.FirewallAsyncClientTest)
Starting test testAddFirewallRule(org.jclouds.savvis.vpdc.features.FirewallAsyncClientTest)
[pool-2-thread-5] Test testAddFirewallRule(org.jclouds.savvis.vpdc.features.FirewallAsyncClientTest) succeeded: 8ms
Test suite progress: tests succeeded: 51, failed: 0, skipped: 0.
[pool-2-thread-3] Test testPowerOnVMVDC(org.jclouds.savvis.vpdc.features.ServiceManagementAsyncClientTest) succeeded: 29ms
Test suite progress: tests succeeded: 52, failed: 0, skipped: 0.
[pool-2-thread-2] Test testDeleteFirewallRule(org.jclouds.savvis.vpdc.features.FirewallAsyncClientTest) succeeded: 16ms
Test suite progress: tests succeeded: 53, failed: 0, skipped: 0.
Starting test testInRestProperties(org.jclouds.savvis.vpdc.SavvisSymphonyVPDCProviderTest)
Starting test testWithId(org.jclouds.savvis.vpdc.SavvisSymphonyVPDCProviderTest)
Starting test testAllContains(org.jclouds.savvis.vpdc.SavvisSymphonyVPDCProviderTest)
Starting test testOfTypeContains(org.jclouds.savvis.vpdc.SavvisSymphonyVPDCProviderTest)
[pool-3-thread-4] Test testOfTypeContains(org.jclouds.savvis.vpdc.SavvisSymphonyVPDCProviderTest) succeeded: 3ms
Test suite progress: tests succeeded: 54, failed: 0, skipped: 0.
[pool-3-thread-3] Test testAllContains(org.jclouds.savvis.vpdc.SavvisSymphonyVPDCProviderTest) succeeded: 4ms
Test suite progress: tests succeeded: 55, failed: 0, skipped: 0.
[pool-3-thread-2] Test testWithId(org.jclouds.savvis.vpdc.SavvisSymphonyVPDCProviderTest) succeeded: 10ms
Test suite progress: tests succeeded: 56, failed: 0, skipped: 0.
[pool-3-thread-1] Test testInRestProperties(org.jclouds.savvis.vpdc.SavvisSymphonyVPDCProviderTest) succeeded: 19ms
Test suite progress: tests succeeded: 57, failed: 0, skipped: 0.
Starting test testAsync(org.jclouds.savvis.vpdc.VPDCAsyncClientTest)
Starting test testSync(org.jclouds.savvis.vpdc.VPDCAsyncClientTest)
[pool-4-thread-2] Test testSync(org.jclouds.savvis.vpdc.VPDCAsyncClientTest) succeeded: 41ms
Test suite progress: tests succeeded: 58, failed: 0, skipped: 0.
[pool-4-thread-1] Test testAsync(org.jclouds.savvis.vpdc.VPDCAsyncClientTest) succeeded: 53ms
Test suite progress: tests succeeded: 59, failed: 0, skipped: 0.
Starting test testError(org.jclouds.savvis.vpdc.xml.TaskHandlerTest)
Starting test testQueued(org.jclouds.savvis.vpdc.xml.TaskHandlerTest)
Starting test testUnsupported(org.jclouds.savvis.vpdc.xml.TaskHandlerTest)
[pool-5-thread-2] Test testQueued(org.jclouds.savvis.vpdc.xml.TaskHandlerTest) succeeded: 5ms
Test suite progress: tests succeeded: 60, failed: 0, skipped: 0.
Starting test testFailed(org.jclouds.savvis.vpdc.xml.TaskHandlerTest)
[pool-5-thread-1] Test testError(org.jclouds.savvis.vpdc.xml.TaskHandlerTest) succeeded: 7ms
Test suite progress: tests succeeded: 61, failed: 0, skipped: 0.
[pool-5-thread-3] Test testUnsupported(org.jclouds.savvis.vpdc.xml.TaskHandlerTest) succeeded: 5ms
Test suite progress: tests succeeded: 62, failed: 0, skipped: 0.
[pool-5-thread-4] Test testFailed(org.jclouds.savvis.vpdc.xml.TaskHandlerTest) succeeded: 3ms
Test suite progress: tests succeeded: 63, failed: 0, skipped: 0.
Starting test testVMDKSuccess(org.jclouds.savvis.vpdc.xml.TaskHandlerTest)
Starting test testRunning(org.jclouds.savvis.vpdc.xml.TaskHandlerTest)
[pool-5-thread-5] Test testVMDKSuccess(org.jclouds.savvis.vpdc.xml.TaskHandlerTest) succeeded: 2ms
Test suite progress: tests succeeded: 64, failed: 0, skipped: 0.
Starting test testVAppSuccess(org.jclouds.savvis.vpdc.xml.TaskHandlerTest)
[pool-5-thread-4] Test testRunning(org.jclouds.savvis.vpdc.xml.TaskHandlerTest) succeeded: 2ms
Test suite progress: tests succeeded: 65, failed: 0, skipped: 0.
[pool-5-thread-5] Test testVAppSuccess(org.jclouds.savvis.vpdc.xml.TaskHandlerTest) succeeded: 2ms
Test suite progress: tests succeeded: 66, failed: 0, skipped: 0.
Tests run: 66, Failures: 0, Errors: 0, Skipped: 0, Time elapsed: 2.975 sec
Results :
Tests run: 66, Failures: 0, Errors: 0, Skipped: 0
[INFO]
[INFO] --- clojure-maven-plugin:1.3.3:test (test-clojure) @ savvis-symphonyvpdc ---
Testing user
Ran 0 tests containing 0 assertions.
0 failures, 0 errors.
[INFO]
[INFO] --- maven-bundle-plugin:2.3.4:bundle (default-bundle) @ savvis-symphonyvpdc ---
[INFO]
[INFO] --- maven-source-plugin:2.1.1:jar-no-fork (attach-sources) @ savvis-symphonyvpdc ---
[INFO] Building jar: /Users/adriancole/workspace/git/jclouds/providers/savvis-symphonyvpdc/target/savvis-symphonyvpdc-1.3.0-SNAPSHOT-sources.jar
[INFO]
[INFO] --- maven-javadoc-plugin:2.8:jar (javadoc) @ savvis-symphonyvpdc ---
[INFO] Skipping javadoc generation
[INFO]
[INFO] --- maven-jar-plugin:2.3.1:test-jar (default) @ savvis-symphonyvpdc ---
[INFO] Building jar: /Users/adriancole/workspace/git/jclouds/providers/savvis-symphonyvpdc/target/savvis-symphonyvpdc-1.3.0-SNAPSHOT-tests.jar
[INFO]
[INFO] --- maven-surefire-plugin:2.10:test (integration) @ savvis-symphonyvpdc ---
[INFO] Surefire report directory: /Users/adriancole/workspace/git/jclouds/providers/savvis-symphonyvpdc/target/surefire-reports
[INFO] Using configured provider org.apache.maven.surefire.testng.TestNGProvider
-------------------------------------------------------
T E S T S
-------------------------------------------------------
Running TestSuite
Starting test testAddFirewallRule(org.jclouds.savvis.vpdc.features.FirewallClientLiveTest)
[pool-2-thread-1] Test testAddFirewallRule(org.jclouds.savvis.vpdc.features.FirewallClientLiveTest) failed.
Test suite progress: tests succeeded: 0, failed: 1, skipped: 0.
[pool-2-thread-1] Test testDeleteFirewallRule(org.jclouds.savvis.vpdc.features.FirewallClientLiveTest) skipped.
Test suite progress: tests succeeded: 0, failed: 1, skipped: 1.
Starting test testCreateVirtualMachine(org.jclouds.savvis.vpdc.features.VMClientLiveTest)
[pool-2-thread-1] Test testCreateVirtualMachine(org.jclouds.savvis.vpdc.features.VMClientLiveTest) failed.
Test suite progress: tests succeeded: 0, failed: 2, skipped: 1.
[pool-2-thread-1] Test testCloneVApp(org.jclouds.savvis.vpdc.features.VMClientLiveTest) skipped.
Test suite progress: tests succeeded: 0, failed: 2, skipped: 2.
[pool-2-thread-1] Test testZCreateMultipleVMs(org.jclouds.savvis.vpdc.features.VMClientLiveTest) skipped.
Test suite progress: tests succeeded: 0, failed: 2, skipped: 3.
Starting test testGetFirewallRules(org.jclouds.savvis.vpdc.features.BrowsingClientLiveTest)
[pool-2-thread-1] Test testGetFirewallRules(org.jclouds.savvis.vpdc.features.BrowsingClientLiveTest) failed.
Test suite progress: tests succeeded: 0, failed: 3, skipped: 3.
Starting test testNetwork(org.jclouds.savvis.vpdc.features.BrowsingClientLiveTest)
[pool-2-thread-1] Test testNetwork(org.jclouds.savvis.vpdc.features.BrowsingClientLiveTest) failed.
Test suite progress: tests succeeded: 0, failed: 4, skipped: 3.
Starting test testOrg(org.jclouds.savvis.vpdc.features.BrowsingClientLiveTest)
[pool-2-thread-1] Test testOrg(org.jclouds.savvis.vpdc.features.BrowsingClientLiveTest) failed.
Test suite progress: tests succeeded: 0, failed: 5, skipped: 3.
Starting test testVDC(org.jclouds.savvis.vpdc.features.BrowsingClientLiveTest)
[pool-2-thread-1] Test testVDC(org.jclouds.savvis.vpdc.features.BrowsingClientLiveTest) failed.
Test suite progress: tests succeeded: 0, failed: 6, skipped: 3.
Starting test testVM(org.jclouds.savvis.vpdc.features.BrowsingClientLiveTest)
[pool-2-thread-1] Test testVM(org.jclouds.savvis.vpdc.features.BrowsingClientLiveTest) failed.
Test suite progress: tests succeeded: 0, failed: 7, skipped: 3.
Starting test testTemplateBuilderWithImageIdSpecified(org.jclouds.savvis.vpdc.compute.VPDCTemplateBuilderLiveTest)
[pool-2-thread-1] Test testTemplateBuilderWithImageIdSpecified(org.jclouds.savvis.vpdc.compute.VPDCTemplateBuilderLiveTest) failed.
Test suite progress: tests succeeded: 0, failed: 8, skipped: 3.
Starting test testTemplateBuilderWithLoginUserSpecified(org.jclouds.savvis.vpdc.compute.VPDCTemplateBuilderLiveTest)
[pool-2-thread-1] Test testTemplateBuilderWithLoginUserSpecified(org.jclouds.savvis.vpdc.compute.VPDCTemplateBuilderLiveTest) failed.
Exception in thread "user thread 1" Test suite progress: tests succeeded: 0, failed: 9, skipped: 3.
java.lang.IllegalStateException: interrupted calling get() on [[method=LoginAsyncClient.login, request=POST https://api.symphonyvpdc.savvis.net/vpdc/v1.0/login HTTP/1.1]], so could not run listeners
at org.jclouds.concurrent.Futures$CallGetAndRunExecutionList.run(Futures.java:66)
at java.util.concurrent.ThreadPoolExecutor$Worker.runTask(ThreadPoolExecutor.java:886)
at java.util.concurrent.ThreadPoolExecutor$Worker.run(ThreadPoolExecutor.java:908)
at java.lang.Thread.run(Thread.java:680)
Caused by: java.lang.InterruptedException
at java.util.concurrent.locks.AbstractQueuedSynchronizer.doAcquireSharedInterruptibly(AbstractQueuedSynchronizer.java:979)
at java.util.concurrent.locks.AbstractQueuedSynchronizer.acquireSharedInterruptibly(AbstractQueuedSynchronizer.java:1281)
at java.util.concurrent.FutureTask$Sync.innerGet(FutureTask.java:218)
at java.util.concurrent.FutureTask.get(FutureTask.java:83)
at org.jclouds.concurrent.config.ExecutorServiceModule$DescribedFuture.get(ExecutorServiceModule.java:237)
at org.jclouds.concurrent.Futures$CallGetAndRunExecutionList.run(Futures.java:59)
... 3 more
Caused by: java.util.concurrent.ExecutionException: task submitted from the following trace
at org.jclouds.concurrent.config.ExecutorServiceModule$DescribedFuture.ensureCauseHasSubmissionTrace(ExecutorServiceModule.java:270)
at org.jclouds.concurrent.config.ExecutorServiceModule$DescribedFuture.get(ExecutorServiceModule.java:241)
... 4 more
Exception in thread "user thread 8" java.lang.IllegalStateException: interrupted calling get() on [[method=LoginAsyncClient.login, request=POST https://api.symphonyvpdc.savvis.net/vpdc/v1.0/login HTTP/1.1]], so could not run listeners
at org.jclouds.concurrent.Futures$CallGetAndRunExecutionList.run(Futures.java:66)
at java.util.concurrent.ThreadPoolExecutor$Worker.runTask(ThreadPoolExecutor.java:886)
at java.util.concurrent.ThreadPoolExecutor$Worker.run(ThreadPoolExecutor.java:908)
at java.lang.Thread.run(Thread.java:680)
Caused by: java.lang.InterruptedException
at java.util.concurrent.locks.AbstractQueuedSynchronizer.doAcquireSharedInterruptibly(AbstractQueuedSynchronizer.java:979)
at java.util.concurrent.locks.AbstractQueuedSynchronizer.acquireSharedInterruptibly(AbstractQueuedSynchronizer.java:1281)
at java.util.concurrent.FutureTask$Sync.innerGet(FutureTask.java:218)
at java.util.concurrent.FutureTask.get(FutureTask.java:83)
at org.jclouds.concurrent.config.ExecutorServiceModule$DescribedFuture.get(ExecutorServiceModule.java:237)
at org.jclouds.concurrent.Futures$CallGetAndRunExecutionList.run(Futures.java:59)
... 3 more
Caused by: java.util.concurrent.ExecutionException: task submitted from the following trace
at org.jclouds.concurrent.config.ExecutorServiceModule$DescribedFuture.ensureCauseHasSubmissionTrace(ExecutorServiceModule.java:270)
at org.jclouds.concurrent.config.ExecutorServiceModule$DescribedFuture.get(ExecutorServiceModule.java:241)
... 4 more
Exception in thread "user thread 0" java.lang.IllegalStateException: interrupted calling get() on [[method=LoginAsyncClient.login, request=POST https://api.symphonyvpdc.savvis.net/vpdc/v1.0/login HTTP/1.1]], so could not run listeners
at org.jclouds.concurrent.Futures$CallGetAndRunExecutionList.run(Futures.java:66)
at java.util.concurrent.ThreadPoolExecutor$Worker.runTask(ThreadPoolExecutor.java:886)
at java.util.concurrent.ThreadPoolExecutor$Worker.run(ThreadPoolExecutor.java:908)
at java.lang.Thread.run(Thread.java:680)
Caused by: java.lang.InterruptedException
at java.util.concurrent.locks.AbstractQueuedSynchronizer.doAcquireSharedInterruptibly(AbstractQueuedSynchronizer.java:979)
at java.util.concurrent.locks.AbstractQueuedSynchronizer.acquireSharedInterruptibly(AbstractQueuedSynchronizer.java:1281)
at java.util.concurrent.FutureTask$Sync.innerGet(FutureTask.java:218)
at java.util.concurrent.FutureTask.get(FutureTask.java:83)
at org.jclouds.concurrent.config.ExecutorServiceModule$DescribedFuture.get(ExecutorServiceModule.java:237)
at org.jclouds.concurrent.Futures$CallGetAndRunExecutionList.run(Futures.java:59)
... 3 more
Caused by: java.util.concurrent.ExecutionException: task submitted from the following trace
at org.jclouds.concurrent.config.ExecutorServiceModule$DescribedFuture.ensureCauseHasSubmissionTrace(ExecutorServiceModule.java:270)
at org.jclouds.concurrent.config.ExecutorServiceModule$DescribedFuture.get(ExecutorServiceModule.java:241)
... 4 more
Exception in thread "user thread 7" java.lang.IllegalStateException: interrupted calling get() on [[method=LoginAsyncClient.login, request=POST https://api.symphonyvpdc.savvis.net/vpdc/v1.0/login HTTP/1.1]], so could not run listeners
at org.jclouds.concurrent.Futures$CallGetAndRunExecutionList.run(Futures.java:66)
at java.util.concurrent.ThreadPoolExecutor$Worker.runTask(ThreadPoolExecutor.java:886)
at java.util.concurrent.ThreadPoolExecutor$Worker.run(ThreadPoolExecutor.java:908)
at java.lang.Thread.run(Thread.java:680)
Caused by: java.lang.InterruptedException
at java.util.concurrent.locks.AbstractQueuedSynchronizer.doAcquireSharedInterruptibly(AbstractQueuedSynchronizer.java:979)
at java.util.concurrent.locks.AbstractQueuedSynchronizer.acquireSharedInterruptibly(AbstractQueuedSynchronizer.java:1281)
at java.util.concurrent.FutureTask$Sync.innerGet(FutureTask.java:218)
at java.util.concurrent.FutureTask.get(FutureTask.java:83)
at org.jclouds.concurrent.config.ExecutorServiceModule$DescribedFuture.get(ExecutorServiceModule.java:237)
at org.jclouds.concurrent.Futures$CallGetAndRunExecutionList.run(Futures.java:59)
... 3 more
Caused by: java.util.concurrent.ExecutionException: task submitted from the following trace
at org.jclouds.concurrent.config.ExecutorServiceModule$DescribedFuture.ensureCauseHasSubmissionTrace(ExecutorServiceModule.java:270)
at org.jclouds.concurrent.config.ExecutorServiceModule$DescribedFuture.get(ExecutorServiceModule.java:241)
... 4 more
Exception in thread "user thread 2" java.lang.IllegalStateException: interrupted calling get() on [[method=LoginAsyncClient.login, request=POST https://api.symphonyvpdc.savvis.net/vpdc/v1.0/login HTTP/1.1]], so could not run listeners
at org.jclouds.concurrent.Futures$CallGetAndRunExecutionList.run(Futures.java:66)
at java.util.concurrent.ThreadPoolExecutor$Worker.runTask(ThreadPoolExecutor.java:886)
at java.util.concurrent.ThreadPoolExecutor$Worker.run(ThreadPoolExecutor.java:908)
at java.lang.Thread.run(Thread.java:680)
Caused by: java.lang.InterruptedException
at java.util.concurrent.locks.AbstractQueuedSynchronizer.doAcquireSharedInterruptibly(AbstractQueuedSynchronizer.java:979)
at java.util.concurrent.locks.AbstractQueuedSynchronizer.acquireSharedInterruptibly(AbstractQueuedSynchronizer.java:1281)
at java.util.concurrent.FutureTask$Sync.innerGet(FutureTask.java:218)
at java.util.concurrent.FutureTask.get(FutureTask.java:83)
at org.jclouds.concurrent.config.ExecutorServiceModule$DescribedFuture.get(ExecutorServiceModule.java:237)
at org.jclouds.concurrent.Futures$CallGetAndRunExecutionList.run(Futures.java:59)
... 3 more
Caused by: java.util.concurrent.ExecutionException: task submitted from the following trace
at org.jclouds.concurrent.config.ExecutorServiceModule$DescribedFuture.ensureCauseHasSubmissionTrace(ExecutorServiceModule.java:270)
at org.jclouds.concurrent.config.ExecutorServiceModule$DescribedFuture.get(ExecutorServiceModule.java:241)
... 4 more
Exception in thread "user thread 4" java.lang.IllegalStateException: interrupted calling get() on [[method=LoginAsyncClient.login, request=POST https://api.symphonyvpdc.savvis.net/vpdc/v1.0/login HTTP/1.1]], so could not run listeners
at org.jclouds.concurrent.Futures$CallGetAndRunExecutionList.run(Futures.java:66)
at java.util.concurrent.ThreadPoolExecutor$Worker.runTask(ThreadPoolExecutor.java:886)
at java.util.concurrent.ThreadPoolExecutor$Worker.run(ThreadPoolExecutor.java:908)
at java.lang.Thread.run(Thread.java:680)
Caused by: java.lang.InterruptedException
at java.util.concurrent.locks.AbstractQueuedSynchronizer.doAcquireSharedInterruptibly(AbstractQueuedSynchronizer.java:979)
at java.util.concurrent.locks.AbstractQueuedSynchronizer.acquireSharedInterruptibly(AbstractQueuedSynchronizer.java:1281)
at java.util.concurrent.FutureTask$Sync.innerGet(FutureTask.java:218)
at java.util.concurrent.FutureTask.get(FutureTask.java:83)
at org.jclouds.concurrent.config.ExecutorServiceModule$DescribedFuture.get(ExecutorServiceModule.java:237)
at org.jclouds.concurrent.Futures$CallGetAndRunExecutionList.run(Futures.java:59)
... 3 more
Caused by: java.util.concurrent.ExecutionException: task submitted from the following trace
at org.jclouds.concurrent.config.ExecutorServiceModule$DescribedFuture.ensureCauseHasSubmissionTrace(ExecutorServiceModule.java:270)
at org.jclouds.concurrent.config.ExecutorServiceModule$DescribedFuture.get(ExecutorServiceModule.java:241)
... 4 more
Exception in thread "user thread 5" java.lang.IllegalStateException: interrupted calling get() on [[method=LoginAsyncClient.login, request=POST https://api.symphonyvpdc.savvis.net/vpdc/v1.0/login HTTP/1.1]], so could not run listeners
at org.jclouds.concurrent.Futures$CallGetAndRunExecutionList.run(Futures.java:66)
at java.util.concurrent.ThreadPoolExecutor$Worker.runTask(ThreadPoolExecutor.java:886)
at java.util.concurrent.ThreadPoolExecutor$Worker.run(ThreadPoolExecutor.java:908)
at java.lang.Thread.run(Thread.java:680)
Caused by: java.lang.InterruptedException
at java.util.concurrent.locks.AbstractQueuedSynchronizer.doAcquireSharedInterruptibly(AbstractQueuedSynchronizer.java:979)
at java.util.concurrent.locks.AbstractQueuedSynchronizer.acquireSharedInterruptibly(AbstractQueuedSynchronizer.java:1281)
at java.util.concurrent.FutureTask$Sync.innerGet(FutureTask.java:218)
at java.util.concurrent.FutureTask.get(FutureTask.java:83)
at org.jclouds.concurrent.config.ExecutorServiceModule$DescribedFuture.get(ExecutorServiceModule.java:237)
at org.jclouds.concurrent.Futures$CallGetAndRunExecutionList.run(Futures.java:59)
... 3 more
Caused by: java.util.concurrent.ExecutionException: task submitted from the following trace
at org.jclouds.concurrent.config.ExecutorServiceModule$DescribedFuture.ensureCauseHasSubmissionTrace(ExecutorServiceModule.java:270)
at org.jclouds.concurrent.config.ExecutorServiceModule$DescribedFuture.get(ExecutorServiceModule.java:241)
... 4 more
Exception in thread "user thread 6" java.lang.IllegalStateException: interrupted calling get() on [[method=LoginAsyncClient.login, request=POST https://api.symphonyvpdc.savvis.net/vpdc/v1.0/login HTTP/1.1]], so could not run listeners
at org.jclouds.concurrent.Futures$CallGetAndRunExecutionList.run(Futures.java:66)
at java.util.concurrent.ThreadPoolExecutor$Worker.runTask(ThreadPoolExecutor.java:886)
at java.util.concurrent.ThreadPoolExecutor$Worker.run(ThreadPoolExecutor.java:908)
at java.lang.Thread.run(Thread.java:680)
Caused by: java.lang.InterruptedException
at java.util.concurrent.locks.AbstractQueuedSynchronizer.doAcquireSharedInterruptibly(AbstractQueuedSynchronizer.java:979)
at java.util.concurrent.locks.AbstractQueuedSynchronizer.acquireSharedInterruptibly(AbstractQueuedSynchronizer.java:1281)
at java.util.concurrent.FutureTask$Sync.innerGet(FutureTask.java:218)
at java.util.concurrent.FutureTask.get(FutureTask.java:83)
at org.jclouds.concurrent.config.ExecutorServiceModule$DescribedFuture.get(ExecutorServiceModule.java:237)
at org.jclouds.concurrent.Futures$CallGetAndRunExecutionList.run(Futures.java:59)
... 3 more
Caused by: java.util.concurrent.ExecutionException: task submitted from the following trace
at org.jclouds.concurrent.config.ExecutorServiceModule$DescribedFuture.ensureCauseHasSubmissionTrace(ExecutorServiceModule.java:270)
at org.jclouds.concurrent.config.ExecutorServiceModule$DescribedFuture.get(ExecutorServiceModule.java:241)
... 4 more
Exception in thread "user thread 3" java.lang.IllegalStateException: interrupted calling get() on [[method=LoginAsyncClient.login, request=POST https://api.symphonyvpdc.savvis.net/vpdc/v1.0/login HTTP/1.1]], so could not run listeners
at org.jclouds.concurrent.Futures$CallGetAndRunExecutionList.run(Futures.java:66)
at java.util.concurrent.ThreadPoolExecutor$Worker.runTask(ThreadPoolExecutor.java:886)
at java.util.concurrent.ThreadPoolExecutor$Worker.run(ThreadPoolExecutor.java:908)
at java.lang.Thread.run(Thread.java:680)
Caused by: java.lang.InterruptedException
at java.util.concurrent.locks.AbstractQueuedSynchronizer.doAcquireSharedInterruptibly(AbstractQueuedSynchronizer.java:979)
at java.util.concurrent.locks.AbstractQueuedSynchronizer.acquireSharedInterruptibly(AbstractQueuedSynchronizer.java:1281)
at java.util.concurrent.FutureTask$Sync.innerGet(FutureTask.java:218)
at java.util.concurrent.FutureTask.get(FutureTask.java:83)
at org.jclouds.concurrent.config.ExecutorServiceModule$DescribedFuture.get(ExecutorServiceModule.java:237)
at org.jclouds.concurrent.Futures$CallGetAndRunExecutionList.run(Futures.java:59)
... 3 more
Caused by: java.util.concurrent.ExecutionException: task submitted from the following trace
at org.jclouds.concurrent.config.ExecutorServiceModule$DescribedFuture.ensureCauseHasSubmissionTrace(ExecutorServiceModule.java:270)
at org.jclouds.concurrent.config.ExecutorServiceModule$DescribedFuture.get(ExecutorServiceModule.java:241)
... 4 more
Starting test testTemplateBuilderCannotFind(org.jclouds.savvis.vpdc.compute.VPDCTemplateBuilderLiveTest)
[pool-2-thread-1] Test testTemplateBuilderCannotFind(org.jclouds.savvis.vpdc.compute.VPDCTemplateBuilderLiveTest) failed.
Test suite progress: tests succeeded: 0, failed: 10, skipped: 3.
Starting test testTemplateBuilderCannotFind(org.jclouds.savvis.vpdc.compute.VPDCTemplateBuilderLiveTest)
[pool-2-thread-1] Test testTemplateBuilderCannotFind(org.jclouds.savvis.vpdc.compute.VPDCTemplateBuilderLiveTest) failed.
Test suite progress: tests succeeded: 0, failed: 11, skipped: 3.
Starting test testTemplateBuilderCannotFind(org.jclouds.savvis.vpdc.compute.VPDCTemplateBuilderLiveTest)
[pool-2-thread-1] Test testTemplateBuilderCannotFind(org.jclouds.savvis.vpdc.compute.VPDCTemplateBuilderLiveTest) failed.
Test suite progress: tests succeeded: 0, failed: 12, skipped: 3.
Starting test testTemplateBuilderCannotFind(org.jclouds.savvis.vpdc.compute.VPDCTemplateBuilderLiveTest)
[pool-2-thread-1] Test testTemplateBuilderCannotFind(org.jclouds.savvis.vpdc.compute.VPDCTemplateBuilderLiveTest) failed.
Test suite progress: tests succeeded: 0, failed: 13, skipped: 3.
Starting test testTemplateBuilderCannotFind(org.jclouds.savvis.vpdc.compute.VPDCTemplateBuilderLiveTest)
[pool-2-thread-1] Test testTemplateBuilderCannotFind(org.jclouds.savvis.vpdc.compute.VPDCTemplateBuilderLiveTest) failed.
Test suite progress: tests succeeded: 0, failed: 14, skipped: 3.
Starting test testTemplateBuilderCannotFind(org.jclouds.savvis.vpdc.compute.VPDCTemplateBuilderLiveTest)
[pool-2-thread-1] Test testTemplateBuilderCannotFind(org.jclouds.savvis.vpdc.compute.VPDCTemplateBuilderLiveTest) failed.
Test suite progress: tests succeeded: 0, failed: 15, skipped: 3.
Starting test testTemplateBuilderCannotFind(org.jclouds.savvis.vpdc.compute.VPDCTemplateBuilderLiveTest)
[pool-2-thread-1] Test testTemplateBuilderCannotFind(org.jclouds.savvis.vpdc.compute.VPDCTemplateBuilderLiveTest) failed.
Test suite progress: tests succeeded: 0, failed: 16, skipped: 3.
Starting test testTemplateBuilderCannotFind(org.jclouds.savvis.vpdc.compute.VPDCTemplateBuilderLiveTest)
[pool-2-thread-1] Test testTemplateBuilderCannotFind(org.jclouds.savvis.vpdc.compute.VPDCTemplateBuilderLiveTest) failed.
Test suite progress: tests succeeded: 0, failed: 17, skipped: 3.
Starting test testTemplateBuilderCannotFind(org.jclouds.savvis.vpdc.compute.VPDCTemplateBuilderLiveTest)
[pool-2-thread-1] Test testTemplateBuilderCannotFind(org.jclouds.savvis.vpdc.compute.VPDCTemplateBuilderLiveTest) failed.
Test suite progress: tests succeeded: 0, failed: 18, skipped: 3.
Starting test testTemplateBuilderCannotFind(org.jclouds.savvis.vpdc.compute.VPDCTemplateBuilderLiveTest)
[pool-2-thread-1] Test testTemplateBuilderCannotFind(org.jclouds.savvis.vpdc.compute.VPDCTemplateBuilderLiveTest) failed.
Test suite progress: tests succeeded: 0, failed: 19, skipped: 3.
Starting test testTemplateBuilderCannotFind(org.jclouds.savvis.vpdc.compute.VPDCTemplateBuilderLiveTest)
[pool-2-thread-1] Test testTemplateBuilderCannotFind(org.jclouds.savvis.vpdc.compute.VPDCTemplateBuilderLiveTest) failed.
Test suite progress: tests succeeded: 0, failed: 20, skipped: 3.
Starting test testTemplateBuilderCannotFind(org.jclouds.savvis.vpdc.compute.VPDCTemplateBuilderLiveTest)
[pool-2-thread-1] Test testTemplateBuilderCannotFind(org.jclouds.savvis.vpdc.compute.VPDCTemplateBuilderLiveTest) failed.
Test suite progress: tests succeeded: 0, failed: 21, skipped: 3.
Starting test testTemplateBuilderCannotFind(org.jclouds.savvis.vpdc.compute.VPDCTemplateBuilderLiveTest)
[pool-2-thread-1] Test testTemplateBuilderCannotFind(org.jclouds.savvis.vpdc.compute.VPDCTemplateBuilderLiveTest) failed.
Test suite progress: tests succeeded: 0, failed: 22, skipped: 3.
Starting test testTemplateBuilderCannotFind(org.jclouds.savvis.vpdc.compute.VPDCTemplateBuilderLiveTest)
[pool-2-thread-1] Test testTemplateBuilderCannotFind(org.jclouds.savvis.vpdc.compute.VPDCTemplateBuilderLiveTest) failed.
Test suite progress: tests succeeded: 0, failed: 23, skipped: 3.
Starting test testTemplateBuilderCannotFind(org.jclouds.savvis.vpdc.compute.VPDCTemplateBuilderLiveTest)
[pool-2-thread-1] Test testTemplateBuilderCannotFind(org.jclouds.savvis.vpdc.compute.VPDCTemplateBuilderLiveTest) failed.
Test suite progress: tests succeeded: 0, failed: 24, skipped: 3.
Starting test testTemplateBuilderCannotFind(org.jclouds.savvis.vpdc.compute.VPDCTemplateBuilderLiveTest)
[pool-2-thread-1] Test testTemplateBuilderCannotFind(org.jclouds.savvis.vpdc.compute.VPDCTemplateBuilderLiveTest) failed.
Test suite progress: tests succeeded: 0, failed: 25, skipped: 3.
Starting test testTemplateBuilderCannotFind(org.jclouds.savvis.vpdc.compute.VPDCTemplateBuilderLiveTest)
[pool-2-thread-1] Test testTemplateBuilderCannotFind(org.jclouds.savvis.vpdc.compute.VPDCTemplateBuilderLiveTest) failed.
Test suite progress: tests succeeded: 0, failed: 26, skipped: 3.
Starting test testTemplateBuilderCannotFind(org.jclouds.savvis.vpdc.compute.VPDCTemplateBuilderLiveTest)
[pool-2-thread-1] Test testTemplateBuilderCannotFind(org.jclouds.savvis.vpdc.compute.VPDCTemplateBuilderLiveTest) failed.
Test suite progress: tests succeeded: 0, failed: 27, skipped: 3.
Starting test testTemplateBuilderCannotFind(org.jclouds.savvis.vpdc.compute.VPDCTemplateBuilderLiveTest)
[pool-2-thread-1] Test testTemplateBuilderCannotFind(org.jclouds.savvis.vpdc.compute.VPDCTemplateBuilderLiveTest) failed.
Test suite progress: tests succeeded: 0, failed: 28, skipped: 3.
Starting test testTemplateBuilderCannotFind(org.jclouds.savvis.vpdc.compute.VPDCTemplateBuilderLiveTest)
[pool-2-thread-1] Test testTemplateBuilderCannotFind(org.jclouds.savvis.vpdc.compute.VPDCTemplateBuilderLiveTest) failed.
Test suite progress: tests succeeded: 0, failed: 29, skipped: 3.
Starting test testTemplateBuilderCannotFind(org.jclouds.savvis.vpdc.compute.VPDCTemplateBuilderLiveTest)
[pool-2-thread-1] Test testTemplateBuilderCannotFind(org.jclouds.savvis.vpdc.compute.VPDCTemplateBuilderLiveTest) failed.
Test suite progress: tests succeeded: 0, failed: 30, skipped: 3.
Starting test testTemplateBuilderCannotFind(org.jclouds.savvis.vpdc.compute.VPDCTemplateBuilderLiveTest)
[pool-2-thread-1] Test testTemplateBuilderCannotFind(org.jclouds.savvis.vpdc.compute.VPDCTemplateBuilderLiveTest) failed.
Test suite progress: tests succeeded: 0, failed: 31, skipped: 3.
Starting test testTemplateBuilderCannotFind(org.jclouds.savvis.vpdc.compute.VPDCTemplateBuilderLiveTest)
[pool-2-thread-1] Test testTemplateBuilderCannotFind(org.jclouds.savvis.vpdc.compute.VPDCTemplateBuilderLiveTest) failed.
Test suite progress: tests succeeded: 0, failed: 32, skipped: 3.
Starting test testTemplateBuilderCannotFind(org.jclouds.savvis.vpdc.compute.VPDCTemplateBuilderLiveTest)
[pool-2-thread-1] Test testTemplateBuilderCannotFind(org.jclouds.savvis.vpdc.compute.VPDCTemplateBuilderLiveTest) failed.
Test suite progress: tests succeeded: 0, failed: 33, skipped: 3.
Starting test testTemplateBuilderCannotFind(org.jclouds.savvis.vpdc.compute.VPDCTemplateBuilderLiveTest)
[pool-2-thread-1] Test testTemplateBuilderCannotFind(org.jclouds.savvis.vpdc.compute.VPDCTemplateBuilderLiveTest) failed.
Test suite progress: tests succeeded: 0, failed: 34, skipped: 3.
Starting test testTemplateBuilderCannotFind(org.jclouds.savvis.vpdc.compute.VPDCTemplateBuilderLiveTest)
[pool-2-thread-1] Test testTemplateBuilderCannotFind(org.jclouds.savvis.vpdc.compute.VPDCTemplateBuilderLiveTest) failed.
Test suite progress: tests succeeded: 0, failed: 35, skipped: 3.
Starting test testTemplateBuilderCannotFind(org.jclouds.savvis.vpdc.compute.VPDCTemplateBuilderLiveTest)
[pool-2-thread-1] Test testTemplateBuilderCannotFind(org.jclouds.savvis.vpdc.compute.VPDCTemplateBuilderLiveTest) failed.
Test suite progress: tests succeeded: 0, failed: 36, skipped: 3.
Starting test testTemplateBuilderCannotFind(org.jclouds.savvis.vpdc.compute.VPDCTemplateBuilderLiveTest)
[pool-2-thread-1] Test testTemplateBuilderCannotFind(org.jclouds.savvis.vpdc.compute.VPDCTemplateBuilderLiveTest) failed.
Test suite progress: tests succeeded: 0, failed: 37, skipped: 3.
Starting test testTemplateBuilderCannotFind(org.jclouds.savvis.vpdc.compute.VPDCTemplateBuilderLiveTest)
[pool-2-thread-1] Test testTemplateBuilderCannotFind(org.jclouds.savvis.vpdc.compute.VPDCTemplateBuilderLiveTest) failed.
Test suite progress: tests succeeded: 0, failed: 38, skipped: 3.
Starting test testTemplateBuilderCannotFind(org.jclouds.savvis.vpdc.compute.VPDCTemplateBuilderLiveTest)
[pool-2-thread-1] Test testTemplateBuilderCannotFind(org.jclouds.savvis.vpdc.compute.VPDCTemplateBuilderLiveTest) failed.
Test suite progress: tests succeeded: 0, failed: 39, skipped: 3.
Starting test testTemplateBuilderCannotFind(org.jclouds.savvis.vpdc.compute.VPDCTemplateBuilderLiveTest)
[pool-2-thread-1] Test testTemplateBuilderCannotFind(org.jclouds.savvis.vpdc.compute.VPDCTemplateBuilderLiveTest) failed.
Test suite progress: tests succeeded: 0, failed: 40, skipped: 3.
Starting test testTemplateBuilderCannotFind(org.jclouds.savvis.vpdc.compute.VPDCTemplateBuilderLiveTest)
[pool-2-thread-1] Test testTemplateBuilderCannotFind(org.jclouds.savvis.vpdc.compute.VPDCTemplateBuilderLiveTest) failed.
Test suite progress: tests succeeded: 0, failed: 41, skipped: 3.
Starting test testTemplateBuilderCannotFind(org.jclouds.savvis.vpdc.compute.VPDCTemplateBuilderLiveTest)
[pool-2-thread-1] Test testTemplateBuilderCannotFind(org.jclouds.savvis.vpdc.compute.VPDCTemplateBuilderLiveTest) failed.
Test suite progress: tests succeeded: 0, failed: 42, skipped: 3.
Starting test testTemplateBuilderCannotFind(org.jclouds.savvis.vpdc.compute.VPDCTemplateBuilderLiveTest)
[pool-2-thread-1] Test testTemplateBuilderCannotFind(org.jclouds.savvis.vpdc.compute.VPDCTemplateBuilderLiveTest) failed.
Test suite progress: tests succeeded: 0, failed: 43, skipped: 3.
Starting test testTemplateBuilderCannotFind(org.jclouds.savvis.vpdc.compute.VPDCTemplateBuilderLiveTest)
[pool-2-thread-1] Test testTemplateBuilderCannotFind(org.jclouds.savvis.vpdc.compute.VPDCTemplateBuilderLiveTest) failed.
Test suite progress: tests succeeded: 0, failed: 44, skipped: 3.
Starting test testTemplateBuilderCannotFind(org.jclouds.savvis.vpdc.compute.VPDCTemplateBuilderLiveTest)
[pool-2-thread-1] Test testTemplateBuilderCannotFind(org.jclouds.savvis.vpdc.compute.VPDCTemplateBuilderLiveTest) failed.
Test suite progress: tests succeeded: 0, failed: 45, skipped: 3.
Starting test testTemplateBuilderCannotFind(org.jclouds.savvis.vpdc.compute.VPDCTemplateBuilderLiveTest)
[pool-2-thread-1] Test testTemplateBuilderCannotFind(org.jclouds.savvis.vpdc.compute.VPDCTemplateBuilderLiveTest) failed.
Test suite progress: tests succeeded: 0, failed: 46, skipped: 3.
Starting test testTemplateBuilderCannotFind(org.jclouds.savvis.vpdc.compute.VPDCTemplateBuilderLiveTest)
[pool-2-thread-1] Test testTemplateBuilderCannotFind(org.jclouds.savvis.vpdc.compute.VPDCTemplateBuilderLiveTest) failed.
Test suite progress: tests succeeded: 0, failed: 47, skipped: 3.
Starting test testTemplateBuilderCannotFind(org.jclouds.savvis.vpdc.compute.VPDCTemplateBuilderLiveTest)
[pool-2-thread-1] Test testTemplateBuilderCannotFind(org.jclouds.savvis.vpdc.compute.VPDCTemplateBuilderLiveTest) failed.
Test suite progress: tests succeeded: 0, failed: 48, skipped: 3.
Starting test testTemplateBuilderCannotFind(org.jclouds.savvis.vpdc.compute.VPDCTemplateBuilderLiveTest)
[pool-2-thread-1] Test testTemplateBuilderCannotFind(org.jclouds.savvis.vpdc.compute.VPDCTemplateBuilderLiveTest) failed.
Test suite progress: tests succeeded: 0, failed: 49, skipped: 3.
Starting test testTemplateBuilderCannotFind(org.jclouds.savvis.vpdc.compute.VPDCTemplateBuilderLiveTest)
[pool-2-thread-1] Test testTemplateBuilderCannotFind(org.jclouds.savvis.vpdc.compute.VPDCTemplateBuilderLiveTest) failed.
Test suite progress: tests succeeded: 0, failed: 50, skipped: 3.
Starting test testTemplateBuilderCannotFind(org.jclouds.savvis.vpdc.compute.VPDCTemplateBuilderLiveTest)
[pool-2-thread-1] Test testTemplateBuilderCannotFind(org.jclouds.savvis.vpdc.compute.VPDCTemplateBuilderLiveTest) failed.
Test suite progress: tests succeeded: 0, failed: 51, skipped: 3.
Starting test testTemplateBuilderCannotFind(org.jclouds.savvis.vpdc.compute.VPDCTemplateBuilderLiveTest)
[pool-2-thread-1] Test testTemplateBuilderCannotFind(org.jclouds.savvis.vpdc.compute.VPDCTemplateBuilderLiveTest) failed.
Test suite progress: tests succeeded: 0, failed: 52, skipped: 3.
Starting test testTemplateBuilderCannotFind(org.jclouds.savvis.vpdc.compute.VPDCTemplateBuilderLiveTest)
[pool-2-thread-1] Test testTemplateBuilderCannotFind(org.jclouds.savvis.vpdc.compute.VPDCTemplateBuilderLiveTest) failed.
Test suite progress: tests succeeded: 0, failed: 53, skipped: 3.
Starting test testTemplateBuilderCannotFind(org.jclouds.savvis.vpdc.compute.VPDCTemplateBuilderLiveTest)
[pool-2-thread-1] Test testTemplateBuilderCannotFind(org.jclouds.savvis.vpdc.compute.VPDCTemplateBuilderLiveTest) failed.
Test suite progress: tests succeeded: 0, failed: 54, skipped: 3.
Starting test testTemplateBuilderCannotFind(org.jclouds.savvis.vpdc.compute.VPDCTemplateBuilderLiveTest)
[pool-2-thread-1] Test testTemplateBuilderCannotFind(org.jclouds.savvis.vpdc.compute.VPDCTemplateBuilderLiveTest) failed.
Test suite progress: tests succeeded: 0, failed: 55, skipped: 3.
Starting test testTemplateBuilderCannotFind(org.jclouds.savvis.vpdc.compute.VPDCTemplateBuilderLiveTest)
[pool-2-thread-1] Test testTemplateBuilderCannotFind(org.jclouds.savvis.vpdc.compute.VPDCTemplateBuilderLiveTest) failed.
Test suite progress: tests succeeded: 0, failed: 56, skipped: 3.
Starting test testTemplateBuilderCannotFind(org.jclouds.savvis.vpdc.compute.VPDCTemplateBuilderLiveTest)
[pool-2-thread-1] Test testTemplateBuilderCannotFind(org.jclouds.savvis.vpdc.compute.VPDCTemplateBuilderLiveTest) failed.
Test suite progress: tests succeeded: 0, failed: 57, skipped: 3.
Starting test testTemplateBuilderCannotFind(org.jclouds.savvis.vpdc.compute.VPDCTemplateBuilderLiveTest)
[pool-2-thread-1] Test testTemplateBuilderCannotFind(org.jclouds.savvis.vpdc.compute.VPDCTemplateBuilderLiveTest) failed.
Test suite progress: tests succeeded: 0, failed: 58, skipped: 3.
Starting test testTemplateBuilderCannotFind(org.jclouds.savvis.vpdc.compute.VPDCTemplateBuilderLiveTest)
[pool-2-thread-1] Test testTemplateBuilderCannotFind(org.jclouds.savvis.vpdc.compute.VPDCTemplateBuilderLiveTest) failed.
Test suite progress: tests succeeded: 0, failed: 59, skipped: 3.
Starting test testTemplateBuilderCannotFind(org.jclouds.savvis.vpdc.compute.VPDCTemplateBuilderLiveTest)
[pool-2-thread-1] Test testTemplateBuilderCannotFind(org.jclouds.savvis.vpdc.compute.VPDCTemplateBuilderLiveTest) failed.
Test suite progress: tests succeeded: 0, failed: 60, skipped: 3.
Starting test testTemplateBuilderCannotFind(org.jclouds.savvis.vpdc.compute.VPDCTemplateBuilderLiveTest)
[pool-2-thread-1] Test testTemplateBuilderCannotFind(org.jclouds.savvis.vpdc.compute.VPDCTemplateBuilderLiveTest) failed.
Test suite progress: tests succeeded: 0, failed: 61, skipped: 3.
Starting test testTemplateBuilderCannotFind(org.jclouds.savvis.vpdc.compute.VPDCTemplateBuilderLiveTest)
[pool-2-thread-1] Test testTemplateBuilderCannotFind(org.jclouds.savvis.vpdc.compute.VPDCTemplateBuilderLiveTest) failed.
Test suite progress: tests succeeded: 0, failed: 62, skipped: 3.
Starting test testTemplateBuilderCannotFind(org.jclouds.savvis.vpdc.compute.VPDCTemplateBuilderLiveTest)
[pool-2-thread-1] Test testTemplateBuilderCannotFind(org.jclouds.savvis.vpdc.compute.VPDCTemplateBuilderLiveTest) failed.
Test suite progress: tests succeeded: 0, failed: 63, skipped: 3.
Starting test testTemplateBuilderCannotFind(org.jclouds.savvis.vpdc.compute.VPDCTemplateBuilderLiveTest)
[pool-2-thread-1] Test testTemplateBuilderCannotFind(org.jclouds.savvis.vpdc.compute.VPDCTemplateBuilderLiveTest) failed.
Test suite progress: tests succeeded: 0, failed: 64, skipped: 3.
Starting test testTemplateBuilderCannotFind(org.jclouds.savvis.vpdc.compute.VPDCTemplateBuilderLiveTest)
[pool-2-thread-1] Test testTemplateBuilderCannotFind(org.jclouds.savvis.vpdc.compute.VPDCTemplateBuilderLiveTest) failed.
Test suite progress: tests succeeded: 0, failed: 65, skipped: 3.
Starting test testTemplateBuilderCannotFind(org.jclouds.savvis.vpdc.compute.VPDCTemplateBuilderLiveTest)
[pool-2-thread-1] Test testTemplateBuilderCannotFind(org.jclouds.savvis.vpdc.compute.VPDCTemplateBuilderLiveTest) failed.
Test suite progress: tests succeeded: 0, failed: 66, skipped: 3.
Starting test testTemplateBuilderCannotFind(org.jclouds.savvis.vpdc.compute.VPDCTemplateBuilderLiveTest)
[pool-2-thread-1] Test testTemplateBuilderCannotFind(org.jclouds.savvis.vpdc.compute.VPDCTemplateBuilderLiveTest) failed.
Test suite progress: tests succeeded: 0, failed: 67, skipped: 3.
Starting test testTemplateBuilderCannotFind(org.jclouds.savvis.vpdc.compute.VPDCTemplateBuilderLiveTest)
[pool-2-thread-1] Test testTemplateBuilderCannotFind(org.jclouds.savvis.vpdc.compute.VPDCTemplateBuilderLiveTest) failed.
Test suite progress: tests succeeded: 0, failed: 68, skipped: 3.
Starting test testTemplateBuilderCannotFind(org.jclouds.savvis.vpdc.compute.VPDCTemplateBuilderLiveTest)
[pool-2-thread-1] Test testTemplateBuilderCannotFind(org.jclouds.savvis.vpdc.compute.VPDCTemplateBuilderLiveTest) failed.
Test suite progress: tests succeeded: 0, failed: 69, skipped: 3.
Starting test testTemplateBuilderCannotFind(org.jclouds.savvis.vpdc.compute.VPDCTemplateBuilderLiveTest)
[pool-2-thread-1] Test testTemplateBuilderCannotFind(org.jclouds.savvis.vpdc.compute.VPDCTemplateBuilderLiveTest) failed.
Test suite progress: tests succeeded: 0, failed: 70, skipped: 3.
Starting test testTemplateBuilderCannotFind(org.jclouds.savvis.vpdc.compute.VPDCTemplateBuilderLiveTest)
[pool-2-thread-1] Test testTemplateBuilderCannotFind(org.jclouds.savvis.vpdc.compute.VPDCTemplateBuilderLiveTest) failed.
Test suite progress: tests succeeded: 0, failed: 71, skipped: 3.
Starting test testTemplateBuilderCannotFind(org.jclouds.savvis.vpdc.compute.VPDCTemplateBuilderLiveTest)
[pool-2-thread-1] Test testTemplateBuilderCannotFind(org.jclouds.savvis.vpdc.compute.VPDCTemplateBuilderLiveTest) failed.
Test suite progress: tests succeeded: 0, failed: 72, skipped: 3.
Starting test testTemplateBuilderCannotFind(org.jclouds.savvis.vpdc.compute.VPDCTemplateBuilderLiveTest)
[pool-2-thread-1] Test testTemplateBuilderCannotFind(org.jclouds.savvis.vpdc.compute.VPDCTemplateBuilderLiveTest) failed.
Test suite progress: tests succeeded: 0, failed: 73, skipped: 3.
Starting test testTemplateBuilderCannotFind(org.jclouds.savvis.vpdc.compute.VPDCTemplateBuilderLiveTest)
[pool-2-thread-1] Test testTemplateBuilderCannotFind(org.jclouds.savvis.vpdc.compute.VPDCTemplateBuilderLiveTest) failed.
Test suite progress: tests succeeded: 0, failed: 74, skipped: 3.
Starting test testTemplateBuilderCannotFind(org.jclouds.savvis.vpdc.compute.VPDCTemplateBuilderLiveTest)
[pool-2-thread-1] Test testTemplateBuilderCannotFind(org.jclouds.savvis.vpdc.compute.VPDCTemplateBuilderLiveTest) failed.
Test suite progress: tests succeeded: 0, failed: 75, skipped: 3.
Starting test testTemplateBuilderCannotFind(org.jclouds.savvis.vpdc.compute.VPDCTemplateBuilderLiveTest)
[pool-2-thread-1] Test testTemplateBuilderCannotFind(org.jclouds.savvis.vpdc.compute.VPDCTemplateBuilderLiveTest) failed.
Test suite progress: tests succeeded: 0, failed: 76, skipped: 3.
Starting test testTemplateBuilderCannotFind(org.jclouds.savvis.vpdc.compute.VPDCTemplateBuilderLiveTest)
[pool-2-thread-1] Test testTemplateBuilderCannotFind(org.jclouds.savvis.vpdc.compute.VPDCTemplateBuilderLiveTest) failed.
Test suite progress: tests succeeded: 0, failed: 77, skipped: 3.
Starting test testTemplateBuilderCannotFind(org.jclouds.savvis.vpdc.compute.VPDCTemplateBuilderLiveTest)
[pool-2-thread-1] Test testTemplateBuilderCannotFind(org.jclouds.savvis.vpdc.compute.VPDCTemplateBuilderLiveTest) failed.
Test suite progress: tests succeeded: 0, failed: 78, skipped: 3.
Starting test testTemplateBuilderCannotFind(org.jclouds.savvis.vpdc.compute.VPDCTemplateBuilderLiveTest)
[pool-2-thread-1] Test testTemplateBuilderCannotFind(org.jclouds.savvis.vpdc.compute.VPDCTemplateBuilderLiveTest) failed.
Test suite progress: tests succeeded: 0, failed: 79, skipped: 3.
Starting test testTemplateBuilderCannotFind(org.jclouds.savvis.vpdc.compute.VPDCTemplateBuilderLiveTest)
[pool-2-thread-1] Test testTemplateBuilderCannotFind(org.jclouds.savvis.vpdc.compute.VPDCTemplateBuilderLiveTest) failed.
Test suite progress: tests succeeded: 0, failed: 80, skipped: 3.
Starting test testTemplateBuilderCannotFind(org.jclouds.savvis.vpdc.compute.VPDCTemplateBuilderLiveTest)
[pool-2-thread-1] Test testTemplateBuilderCannotFind(org.jclouds.savvis.vpdc.compute.VPDCTemplateBuilderLiveTest) failed.
Test suite progress: tests succeeded: 0, failed: 81, skipped: 3.
Starting test testTemplateBuilderCannotFind(org.jclouds.savvis.vpdc.compute.VPDCTemplateBuilderLiveTest)
[pool-2-thread-1] Test testTemplateBuilderCannotFind(org.jclouds.savvis.vpdc.compute.VPDCTemplateBuilderLiveTest) failed.
Test suite progress: tests succeeded: 0, failed: 82, skipped: 3.
Starting test testTemplateBuilderCannotFind(org.jclouds.savvis.vpdc.compute.VPDCTemplateBuilderLiveTest)
[pool-2-thread-1] Test testTemplateBuilderCannotFind(org.jclouds.savvis.vpdc.compute.VPDCTemplateBuilderLiveTest) failed.
Test suite progress: tests succeeded: 0, failed: 83, skipped: 3.
Starting test testTemplateBuilderCannotFind(org.jclouds.savvis.vpdc.compute.VPDCTemplateBuilderLiveTest)
[pool-2-thread-1] Test testTemplateBuilderCannotFind(org.jclouds.savvis.vpdc.compute.VPDCTemplateBuilderLiveTest) failed.
Test suite progress: tests succeeded: 0, failed: 84, skipped: 3.
Starting test testTemplateBuilderCannotFind(org.jclouds.savvis.vpdc.compute.VPDCTemplateBuilderLiveTest)
[pool-2-thread-1] Test testTemplateBuilderCannotFind(org.jclouds.savvis.vpdc.compute.VPDCTemplateBuilderLiveTest) failed.
Test suite progress: tests succeeded: 0, failed: 85, skipped: 3.
Starting test testTemplateBuilderCannotFind(org.jclouds.savvis.vpdc.compute.VPDCTemplateBuilderLiveTest)
[pool-2-thread-1] Test testTemplateBuilderCannotFind(org.jclouds.savvis.vpdc.compute.VPDCTemplateBuilderLiveTest) failed.
Test suite progress: tests succeeded: 0, failed: 86, skipped: 3.
Starting test testTemplateBuilderCannotFind(org.jclouds.savvis.vpdc.compute.VPDCTemplateBuilderLiveTest)
[pool-2-thread-1] Test testTemplateBuilderCannotFind(org.jclouds.savvis.vpdc.compute.VPDCTemplateBuilderLiveTest) failed.
Test suite progress: tests succeeded: 0, failed: 87, skipped: 3.
Starting test testTemplateBuilderCannotFind(org.jclouds.savvis.vpdc.compute.VPDCTemplateBuilderLiveTest)
[pool-2-thread-1] Test testTemplateBuilderCannotFind(org.jclouds.savvis.vpdc.compute.VPDCTemplateBuilderLiveTest) failed.
Test suite progress: tests succeeded: 0, failed: 88, skipped: 3.
Starting test testTemplateBuilderCannotFind(org.jclouds.savvis.vpdc.compute.VPDCTemplateBuilderLiveTest)
[pool-2-thread-1] Test testTemplateBuilderCannotFind(org.jclouds.savvis.vpdc.compute.VPDCTemplateBuilderLiveTest) failed.
Test suite progress: tests succeeded: 0, failed: 89, skipped: 3.
Starting test testDefaultTemplateBuilder(org.jclouds.savvis.vpdc.compute.VPDCTemplateBuilderLiveTest)
[pool-2-thread-1] Test testDefaultTemplateBuilder(org.jclouds.savvis.vpdc.compute.VPDCTemplateBuilderLiveTest) failed.
Test suite progress: tests succeeded: 0, failed: 90, skipped: 3.
Starting test testCompareSizes(org.jclouds.savvis.vpdc.compute.VPDCTemplateBuilderLiveTest)
[pool-2-thread-1] Test testCompareSizes(org.jclouds.savvis.vpdc.compute.VPDCTemplateBuilderLiveTest) failed.
Test suite progress: tests succeeded: 0, failed: 91, skipped: 3.
Starting test testGetAssignableLocations(org.jclouds.savvis.vpdc.compute.VPDCTemplateBuilderLiveTest)
[pool-2-thread-1] Test testGetAssignableLocations(org.jclouds.savvis.vpdc.compute.VPDCTemplateBuilderLiveTest) failed.
Test suite progress: tests succeeded: 0, failed: 92, skipped: 3.
Starting test testTemplateBuilderCanUseImageId(org.jclouds.savvis.vpdc.compute.VPDCTemplateBuilderLiveTest)
[pool-2-thread-1] Test testTemplateBuilderCanUseImageId(org.jclouds.savvis.vpdc.compute.VPDCTemplateBuilderLiveTest) failed.
Test suite progress: tests succeeded: 0, failed: 93, skipped: 3.
Starting test testFromTemplate(org.jclouds.savvis.vpdc.compute.VPDCTemplateBuilderLiveTest)
[pool-2-thread-1] Test testFromTemplate(org.jclouds.savvis.vpdc.compute.VPDCTemplateBuilderLiveTest) failed.
Test suite progress: tests succeeded: 0, failed: 94, skipped: 3.
Starting test testTemplateBuilderCanFind(org.jclouds.savvis.vpdc.compute.VPDCTemplateBuilderLiveTest)
[pool-2-thread-1] Test testTemplateBuilderCanFind(org.jclouds.savvis.vpdc.compute.VPDCTemplateBuilderLiveTest) failed.
Test suite progress: tests succeeded: 0, failed: 95, skipped: 3.
Starting test testTemplateBuilderCanFind(org.jclouds.savvis.vpdc.compute.VPDCTemplateBuilderLiveTest)
[pool-2-thread-1] Test testTemplateBuilderCanFind(org.jclouds.savvis.vpdc.compute.VPDCTemplateBuilderLiveTest) failed.
Test suite progress: tests succeeded: 0, failed: 96, skipped: 3.
Starting test testTemplateBuilderCanFind(org.jclouds.savvis.vpdc.compute.VPDCTemplateBuilderLiveTest)
[pool-2-thread-1] Test testTemplateBuilderCanFind(org.jclouds.savvis.vpdc.compute.VPDCTemplateBuilderLiveTest) failed.
Test suite progress: tests succeeded: 0, failed: 97, skipped: 3.
Starting test testTemplateBuilderCanFind(org.jclouds.savvis.vpdc.compute.VPDCTemplateBuilderLiveTest)
[pool-2-thread-1] Test testTemplateBuilderCanFind(org.jclouds.savvis.vpdc.compute.VPDCTemplateBuilderLiveTest) failed.
Test suite progress: tests succeeded: 0, failed: 98, skipped: 3.
Starting test testLifeCycle(org.jclouds.savvis.vpdc.features.ServiceManagementClientLiveTest)
[pool-2-thread-1] Test testLifeCycle(org.jclouds.savvis.vpdc.features.ServiceManagementClientLiveTest) failed.
Test suite progress: tests succeeded: 0, failed: 99, skipped: 3.
Exception in thread "user thread 191" java.lang.IllegalStateException: interrupted calling get() on [[method=LoginAsyncClient.login, request=POST https://api.symphonyvpdc.savvis.net/vpdc/v1.0/login HTTP/1.1]], so could not run listeners
at org.jclouds.concurrent.Futures$CallGetAndRunExecutionList.run(Futures.java:66)
at java.util.concurrent.ThreadPoolExecutor$Worker.runTask(ThreadPoolExecutor.java:886)
at java.util.concurrent.ThreadPoolExecutor$Worker.run(ThreadPoolExecutor.java:908)
at java.lang.Thread.run(Thread.java:680)
Caused by: java.lang.InterruptedException
at java.util.concurrent.locks.AbstractQueuedSynchronizer.doAcquireSharedInterruptibly(AbstractQueuedSynchronizer.java:979)
at java.util.concurrent.locks.AbstractQueuedSynchronizer.acquireSharedInterruptibly(AbstractQueuedSynchronizer.java:1281)
at java.util.concurrent.FutureTask$Sync.innerGet(FutureTask.java:218)
at java.util.concurrent.FutureTask.get(FutureTask.java:83)
at org.jclouds.concurrent.config.ExecutorServiceModule$DescribedFuture.get(ExecutorServiceModule.java:237)
at org.jclouds.concurrent.Futures$CallGetAndRunExecutionList.run(Futures.java:59)
... 3 more
Caused by: java.util.concurrent.ExecutionException: task submitted from the following trace
at org.jclouds.concurrent.config.ExecutorServiceModule$DescribedFuture.ensureCauseHasSubmissionTrace(ExecutorServiceModule.java:270)
at org.jclouds.concurrent.config.ExecutorServiceModule$DescribedFuture.get(ExecutorServiceModule.java:241)
... 4 more
Exception in thread "user thread 190" java.lang.IllegalStateException: interrupted calling get() on [[method=LoginAsyncClient.login, request=POST https://api.symphonyvpdc.savvis.net/vpdc/v1.0/login HTTP/1.1]], so could not run listeners
at org.jclouds.concurrent.Futures$CallGetAndRunExecutionList.run(Futures.java:66)
at java.util.concurrent.ThreadPoolExecutor$Worker.runTask(ThreadPoolExecutor.java:886)
at java.util.concurrent.ThreadPoolExecutor$Worker.run(ThreadPoolExecutor.java:908)
at java.lang.Thread.run(Thread.java:680)
Caused by: java.lang.InterruptedException
at java.util.concurrent.locks.AbstractQueuedSynchronizer.doAcquireSharedInterruptibly(AbstractQueuedSynchronizer.java:979)
at java.util.concurrent.locks.AbstractQueuedSynchronizer.acquireSharedInterruptibly(AbstractQueuedSynchronizer.java:1281)
at java.util.concurrent.FutureTask$Sync.innerGet(FutureTask.java:218)
at java.util.concurrent.FutureTask.get(FutureTask.java:83)
at org.jclouds.concurrent.config.ExecutorServiceModule$DescribedFuture.get(ExecutorServiceModule.java:237)
at org.jclouds.concurrent.Futures$CallGetAndRunExecutionList.run(Futures.java:59)
... 3 more
Caused by: java.util.concurrent.ExecutionException: task submitted from the following trace
at org.jclouds.concurrent.config.ExecutorServiceModule$DescribedFuture.ensureCauseHasSubmissionTrace(ExecutorServiceModule.java:270)
at org.jclouds.concurrent.config.ExecutorServiceModule$DescribedFuture.get(ExecutorServiceModule.java:241)
... 4 more
Exception in thread "user thread 10" java.lang.IllegalStateException: interrupted calling get() on [[method=LoginAsyncClient.login, request=POST https://api.symphonyvpdc.savvis.net/vpdc/v1.0/login HTTP/1.1]], so could not run listeners
at org.jclouds.concurrent.Futures$CallGetAndRunExecutionList.run(Futures.java:66)
at java.util.concurrent.ThreadPoolExecutor$Worker.runTask(ThreadPoolExecutor.java:886)
at java.util.concurrent.ThreadPoolExecutor$Worker.run(ThreadPoolExecutor.java:908)
at java.lang.Thread.run(Thread.java:680)
Caused by: java.lang.InterruptedException
at java.util.concurrent.locks.AbstractQueuedSynchronizer.doAcquireSharedInterruptibly(AbstractQueuedSynchronizer.java:979)
at java.util.concurrent.locks.AbstractQueuedSynchronizer.acquireSharedInterruptibly(AbstractQueuedSynchronizer.java:1281)
at java.util.concurrent.FutureTask$Sync.innerGet(FutureTask.java:218)
at java.util.concurrent.FutureTask.get(FutureTask.java:83)
at org.jclouds.concurrent.config.ExecutorServiceModule$DescribedFuture.get(ExecutorServiceModule.java:237)
at org.jclouds.concurrent.Futures$CallGetAndRunExecutionList.run(Futures.java:59)
... 3 more
Caused by: java.util.concurrent.ExecutionException: task submitted from the following trace
at org.jclouds.concurrent.config.ExecutorServiceModule$DescribedFuture.ensureCauseHasSubmissionTrace(ExecutorServiceModule.java:270)
at org.jclouds.concurrent.config.ExecutorServiceModule$DescribedFuture.get(ExecutorServiceModule.java:241)
... 4 more
Exception in thread "user thread 600" Exception in thread "user thread 663" Exception in thread "user thread 18" java.lang.IllegalStateException: interrupted calling get() on [[method=LoginAsyncClient.login, request=POST https://api.symphonyvpdc.savvis.net/vpdc/v1.0/login HTTP/1.1]], so could not run listeners
at org.jclouds.concurrent.Futures$CallGetAndRunExecutionList.run(Futures.java:66)
at java.util.concurrent.ThreadPoolExecutor$Worker.runTask(ThreadPoolExecutor.java:886)
at java.util.concurrent.ThreadPoolExecutor$Worker.run(ThreadPoolExecutor.java:908)
at java.lang.Thread.run(Thread.java:680)
Caused by: java.lang.InterruptedException
at java.util.concurrent.locks.AbstractQueuedSynchronizer.doAcquireSharedInterruptibly(AbstractQueuedSynchronizer.java:979)
at java.util.concurrent.locks.AbstractQueuedSynchronizer.acquireSharedInterruptibly(AbstractQueuedSynchronizer.java:1281)
at java.util.concurrent.FutureTask$Sync.innerGet(FutureTask.java:218)
at java.util.concurrent.FutureTask.get(FutureTask.java:83)
at org.jclouds.concurrent.config.ExecutorServiceModule$DescribedFuture.get(ExecutorServiceModule.java:237)
at org.jclouds.concurrent.Futures$CallGetAndRunExecutionList.run(Futures.java:59)
... 3 more
Caused by: java.util.concurrent.ExecutionException: task submitted from the following trace
at org.jclouds.concurrent.config.ExecutorServiceModule$DescribedFuture.ensureCauseHasSubmissionTrace(ExecutorServiceModule.java:270)
at org.jclouds.concurrent.config.ExecutorServiceModule$DescribedFuture.get(ExecutorServiceModule.java:241)
... 4 more
Exception in thread "user thread 0" java.lang.IllegalStateException: interrupted calling get() on [[method=LoginAsyncClient.login, request=POST https://api.symphonyvpdc.savvis.net/vpdc/v1.0/login HTTP/1.1]], so could not run listeners
at org.jclouds.concurrent.Futures$CallGetAndRunExecutionList.run(Futures.java:66)
at java.util.concurrent.ThreadPoolExecutor$Worker.runTask(ThreadPoolExecutor.java:886)
at java.util.concurrent.ThreadPoolExecutor$Worker.run(ThreadPoolExecutor.java:908)
at java.lang.Thread.run(Thread.java:680)
Caused by: java.lang.InterruptedException
at java.util.concurrent.locks.AbstractQueuedSynchronizer.doAcquireSharedInterruptibly(AbstractQueuedSynchronizer.java:979)
at java.util.concurrent.locks.AbstractQueuedSynchronizer.acquireSharedInterruptibly(AbstractQueuedSynchronizer.java:1281)
at java.util.concurrent.FutureTask$Sync.innerGet(FutureTask.java:218)
at java.util.concurrent.FutureTask.get(FutureTask.java:83)
at org.jclouds.concurrent.config.ExecutorServiceModule$DescribedFuture.get(ExecutorServiceModule.java:237)
at org.jclouds.concurrent.Futures$CallGetAndRunExecutionList.run(Futures.java:59)
... 3 more
Caused by: java.util.concurrent.ExecutionException: task submitted from the following trace
at org.jclouds.concurrent.config.ExecutorServiceModule$DescribedFuture.ensureCauseHasSubmissionTrace(ExecutorServiceModule.java:270)
at org.jclouds.concurrent.config.ExecutorServiceModule$DescribedFuture.get(ExecutorServiceModule.java:241)
... 4 more
java.lang.IllegalStateException: interrupted calling get() on [[method=LoginAsyncClient.login, request=POST https://api.symphonyvpdc.savvis.net/vpdc/v1.0/login HTTP/1.1]], so could not run listeners
at org.jclouds.concurrent.Futures$CallGetAndRunExecutionList.run(Futures.java:66)
at java.util.concurrent.ThreadPoolExecutor$Worker.runTask(ThreadPoolExecutor.java:886)
at java.util.concurrent.ThreadPoolExecutor$Worker.run(ThreadPoolExecutor.java:908)
at java.lang.Thread.run(Thread.java:680)
Caused by: java.lang.InterruptedException
at java.util.concurrent.locks.AbstractQueuedSynchronizer.doAcquireSharedInterruptibly(AbstractQueuedSynchronizer.java:979)
at java.util.concurrent.locks.AbstractQueuedSynchronizer.acquireSharedInterruptibly(AbstractQueuedSynchronizer.java:1281)
at java.util.concurrent.FutureTask$Sync.innerGet(FutureTask.java:218)
at java.util.concurrent.FutureTask.get(FutureTask.java:83)
at org.jclouds.concurrent.config.ExecutorServiceModule$DescribedFuture.get(ExecutorServiceModule.java:237)
at org.jclouds.concurrent.Futures$CallGetAndRunExecutionList.run(Futures.java:59)
... 3 more
Caused by: java.util.concurrent.ExecutionException: task submitted from the following trace
at org.jclouds.concurrent.config.ExecutorServiceModule$DescribedFuture.ensureCauseHasSubmissionTrace(ExecutorServiceModule.java:270)
at org.jclouds.concurrent.config.ExecutorServiceModule$DescribedFuture.get(ExecutorServiceModule.java:241)
... 4 more
Exception in thread "user thread 473" java.lang.IllegalStateException: interrupted calling get() on [[method=LoginAsyncClient.login, request=POST https://api.symphonyvpdc.savvis.net/vpdc/v1.0/login HTTP/1.1]], so could not run listeners
at org.jclouds.concurrent.Futures$CallGetAndRunExecutionList.run(Futures.java:66)
at java.util.concurrent.ThreadPoolExecutor$Worker.runTask(ThreadPoolExecutor.java:886)
at java.util.concurrent.ThreadPoolExecutor$Worker.run(ThreadPoolExecutor.java:908)
at java.lang.Thread.run(Thread.java:680)
Caused by: java.lang.InterruptedException
at java.util.concurrent.locks.AbstractQueuedSynchronizer.doAcquireSharedInterruptibly(AbstractQueuedSynchronizer.java:979)
at java.util.concurrent.locks.AbstractQueuedSynchronizer.acquireSharedInterruptibly(AbstractQueuedSynchronizer.java:1281)
at java.util.concurrent.FutureTask$Sync.innerGet(FutureTask.java:218)
at java.util.concurrent.FutureTask.get(FutureTask.java:83)
at org.jclouds.concurrent.config.ExecutorServiceModule$DescribedFuture.get(ExecutorServiceModule.java:237)
at org.jclouds.concurrent.Futures$CallGetAndRunExecutionList.run(Futures.java:59)
... 3 more
Caused by: java.util.concurrent.ExecutionException: task submitted from the following trace
at org.jclouds.concurrent.config.ExecutorServiceModule$DescribedFuture.ensureCauseHasSubmissionTrace(ExecutorServiceModule.java:270)
at org.jclouds.concurrent.config.ExecutorServiceModule$DescribedFuture.get(ExecutorServiceModule.java:241)
... 4 more
Exception in thread "user thread 523" java.lang.IllegalStateException: interrupted calling get() on [[method=LoginAsyncClient.login, request=POST https://api.symphonyvpdc.savvis.net/vpdc/v1.0/login HTTP/1.1]], so could not run listeners
at org.jclouds.concurrent.Futures$CallGetAndRunExecutionList.run(Futures.java:66)
at java.util.concurrent.ThreadPoolExecutor$Worker.runTask(ThreadPoolExecutor.java:886)
at java.util.concurrent.ThreadPoolExecutor$Worker.run(ThreadPoolExecutor.java:908)
at java.lang.Thread.run(Thread.java:680)
Caused by: java.lang.InterruptedException
at java.util.concurrent.locks.AbstractQueuedSynchronizer.doAcquireSharedInterruptibly(AbstractQueuedSynchronizer.java:979)
at java.util.concurrent.locks.AbstractQueuedSynchronizer.acquireSharedInterruptibly(AbstractQueuedSynchronizer.java:1281)
at java.util.concurrent.FutureTask$Sync.innerGet(FutureTask.java:218)
at java.util.concurrent.FutureTask.get(FutureTask.java:83)
at org.jclouds.concurrent.config.ExecutorServiceModule$DescribedFuture.get(ExecutorServiceModule.java:237)
at org.jclouds.concurrent.Futures$CallGetAndRunExecutionList.run(Futures.java:59)
... 3 more
Caused by: java.util.concurrent.ExecutionException: task submitted from the following trace
at org.jclouds.concurrent.config.ExecutorServiceModule$DescribedFuture.ensureCauseHasSubmissionTrace(ExecutorServiceModule.java:270)
at org.jclouds.concurrent.config.ExecutorServiceModule$DescribedFuture.get(ExecutorServiceModule.java:241)
... 4 more
Exception in thread "user thread 573" java.lang.IllegalStateException: interrupted calling get() on [[method=LoginAsyncClient.login, request=POST https://api.symphonyvpdc.savvis.net/vpdc/v1.0/login HTTP/1.1]], so could not run listeners
at org.jclouds.concurrent.Futures$CallGetAndRunExecutionList.run(Futures.java:66)
at java.util.concurrent.ThreadPoolExecutor$Worker.runTask(ThreadPoolExecutor.java:886)
at java.util.concurrent.ThreadPoolExecutor$Worker.run(ThreadPoolExecutor.java:908)
at java.lang.Thread.run(Thread.java:680)
Caused by: java.lang.InterruptedException
at java.util.concurrent.locks.AbstractQueuedSynchronizer.doAcquireSharedInterruptibly(AbstractQueuedSynchronizer.java:979)
at java.util.concurrent.locks.AbstractQueuedSynchronizer.acquireSharedInterruptibly(AbstractQueuedSynchronizer.java:1281)
at java.util.concurrent.FutureTask$Sync.innerGet(FutureTask.java:218)
at java.util.concurrent.FutureTask.get(FutureTask.java:83)
at org.jclouds.concurrent.config.ExecutorServiceModule$DescribedFuture.get(ExecutorServiceModule.java:237)
at org.jclouds.concurrent.Futures$CallGetAndRunExecutionList.run(Futures.java:59)
... 3 more
Caused by: java.util.concurrent.ExecutionException: task submitted from the following trace
at org.jclouds.concurrent.config.ExecutorServiceModule$DescribedFuture.ensureCauseHasSubmissionTrace(ExecutorServiceModule.java:270)
at org.jclouds.concurrent.config.ExecutorServiceModule$DescribedFuture.get(ExecutorServiceModule.java:241)
... 4 more
Exception in thread "user thread 381" java.lang.IllegalStateException: interrupted calling get() on [[method=LoginAsyncClient.login, request=POST https://api.symphonyvpdc.savvis.net/vpdc/v1.0/login HTTP/1.1]], so could not run listeners
at org.jclouds.concurrent.Futures$CallGetAndRunExecutionList.run(Futures.java:66)
at java.util.concurrent.ThreadPoolExecutor$Worker.runTask(ThreadPoolExecutor.java:886)
at java.util.concurrent.ThreadPoolExecutor$Worker.run(ThreadPoolExecutor.java:908)
at java.lang.Thread.run(Thread.java:680)
Caused by: java.lang.InterruptedException
at java.util.concurrent.locks.AbstractQueuedSynchronizer.doAcquireSharedInterruptibly(AbstractQueuedSynchronizer.java:979)
at java.util.concurrent.locks.AbstractQueuedSynchronizer.acquireSharedInterruptibly(AbstractQueuedSynchronizer.java:1281)
at java.util.concurrent.FutureTask$Sync.innerGet(FutureTask.java:218)
at java.util.concurrent.FutureTask.get(FutureTask.java:83)
at org.jclouds.concurrent.config.ExecutorServiceModule$DescribedFuture.get(ExecutorServiceModule.java:237)
at org.jclouds.concurrent.Futures$CallGetAndRunExecutionList.run(Futures.java:59)
... 3 more
Caused by: java.util.concurrent.ExecutionException: task submitted from the following trace
at org.jclouds.concurrent.config.ExecutorServiceModule$DescribedFuture.ensureCauseHasSubmissionTrace(ExecutorServiceModule.java:270)
at org.jclouds.concurrent.config.ExecutorServiceModule$DescribedFuture.get(ExecutorServiceModule.java:241)
... 4 more
Exception in thread "user thread 14" java.lang.IllegalStateException: interrupted calling get() on [[method=LoginAsyncClient.login, request=POST https://api.symphonyvpdc.savvis.net/vpdc/v1.0/login HTTP/1.1]], so could not run listeners
at org.jclouds.concurrent.Futures$CallGetAndRunExecutionList.run(Futures.java:66)
at java.util.concurrent.ThreadPoolExecutor$Worker.runTask(ThreadPoolExecutor.java:886)
at java.util.concurrent.ThreadPoolExecutor$Worker.run(ThreadPoolExecutor.java:908)
at java.lang.Thread.run(Thread.java:680)
Caused by: java.lang.InterruptedException
at java.util.concurrent.locks.AbstractQueuedSynchronizer.doAcquireSharedInterruptibly(AbstractQueuedSynchronizer.java:979)
at java.util.concurrent.locks.AbstractQueuedSynchronizer.acquireSharedInterruptibly(AbstractQueuedSynchronizer.java:1281)
at java.util.concurrent.FutureTask$Sync.innerGet(FutureTask.java:218)
at java.util.concurrent.FutureTask.get(FutureTask.java:83)
at org.jclouds.concurrent.config.ExecutorServiceModule$DescribedFuture.get(ExecutorServiceModule.java:237)
at org.jclouds.concurrent.Futures$CallGetAndRunExecutionList.run(Futures.java:59)
... 3 more
Caused by: java.util.concurrent.ExecutionException: task submitted from the following trace
at org.jclouds.concurrent.config.ExecutorServiceModule$DescribedFuture.ensureCauseHasSubmissionTrace(ExecutorServiceModule.java:270)
at org.jclouds.concurrent.config.ExecutorServiceModule$DescribedFuture.get(ExecutorServiceModule.java:241)
... 4 more
java.lang.IllegalStateException: interrupted calling get() on [[method=LoginAsyncClient.login, request=POST https://api.symphonyvpdc.savvis.net/vpdc/v1.0/login HTTP/1.1]], so could not run listeners
at org.jclouds.concurrent.Futures$CallGetAndRunExecutionList.run(Futures.java:66)
at java.util.concurrent.ThreadPoolExecutor$Worker.runTask(ThreadPoolExecutor.java:886)
at java.util.concurrent.ThreadPoolExecutor$Worker.run(ThreadPoolExecutor.java:908)
at java.lang.Thread.run(Thread.java:680)
Caused by: java.lang.InterruptedException
at java.util.concurrent.locks.AbstractQueuedSynchronizer.doAcquireSharedInterruptibly(AbstractQueuedSynchronizer.java:979)
at java.util.concurrent.locks.AbstractQueuedSynchronizer.acquireSharedInterruptibly(AbstractQueuedSynchronizer.java:1281)
at java.util.concurrent.FutureTask$Sync.innerGet(FutureTask.java:218)
at java.util.concurrent.FutureTask.get(FutureTask.java:83)
at org.jclouds.concurrent.config.ExecutorServiceModule$DescribedFuture.get(ExecutorServiceModule.java:237)
at org.jclouds.concurrent.Futures$CallGetAndRunExecutionList.run(Futures.java:59)
... 3 more
Caused by: java.util.concurrent.ExecutionException: task submitted from the following trace
at org.jclouds.concurrent.config.ExecutorServiceModule$DescribedFuture.ensureCauseHasSubmissionTrace(ExecutorServiceModule.java:270)
at org.jclouds.concurrent.config.ExecutorServiceModule$DescribedFuture.get(ExecutorServiceModule.java:241)
... 4 more
Exception in thread "user thread 665" java.lang.IllegalStateException: interrupted calling get() on [[method=LoginAsyncClient.login, request=POST https://api.symphonyvpdc.savvis.net/vpdc/v1.0/login HTTP/1.1]], so could not run listeners
at org.jclouds.concurrent.Futures$CallGetAndRunExecutionList.run(Futures.java:66)
at java.util.concurrent.ThreadPoolExecutor$Worker.runTask(ThreadPoolExecutor.java:886)
at java.util.concurrent.ThreadPoolExecutor$Worker.run(ThreadPoolExecutor.java:908)
at java.lang.Thread.run(Thread.java:680)
Caused by: java.lang.InterruptedException
at java.util.concurrent.locks.AbstractQueuedSynchronizer.doAcquireSharedInterruptibly(AbstractQueuedSynchronizer.java:979)
at java.util.concurrent.locks.AbstractQueuedSynchronizer.acquireSharedInterruptibly(AbstractQueuedSynchronizer.java:1281)
at java.util.concurrent.FutureTask$Sync.innerGet(FutureTask.java:218)
at java.util.concurrent.FutureTask.get(FutureTask.java:83)
at org.jclouds.concurrent.config.ExecutorServiceModule$DescribedFuture.get(ExecutorServiceModule.java:237)
at org.jclouds.concurrent.Futures$CallGetAndRunExecutionList.run(Futures.java:59)
... 3 more
Caused by: java.util.concurrent.ExecutionException: task submitted from the following trace
at org.jclouds.concurrent.config.ExecutorServiceModule$DescribedFuture.ensureCauseHasSubmissionTrace(ExecutorServiceModule.java:270)
at org.jclouds.concurrent.config.ExecutorServiceModule$DescribedFuture.get(ExecutorServiceModule.java:241)
... 4 more
Exception in thread "user thread 346" java.lang.IllegalStateException: interrupted calling get() on [[method=LoginAsyncClient.login, request=POST https://api.symphonyvpdc.savvis.net/vpdc/v1.0/login HTTP/1.1]], so could not run listeners
at org.jclouds.concurrent.Futures$CallGetAndRunExecutionList.run(Futures.java:66)
at java.util.concurrent.ThreadPoolExecutor$Worker.runTask(ThreadPoolExecutor.java:886)
at java.util.concurrent.ThreadPoolExecutor$Worker.run(ThreadPoolExecutor.java:908)
at java.lang.Thread.run(Thread.java:680)
Caused by: java.lang.InterruptedException
at java.util.concurrent.locks.AbstractQueuedSynchronizer.doAcquireSharedInterruptibly(AbstractQueuedSynchronizer.java:979)
at java.util.concurrent.locks.AbstractQueuedSynchronizer.acquireSharedInterruptibly(AbstractQueuedSynchronizer.java:1281)
at java.util.concurrent.FutureTask$Sync.innerGet(FutureTask.java:218)
at java.util.concurrent.FutureTask.get(FutureTask.java:83)
at org.jclouds.concurrent.config.ExecutorServiceModule$DescribedFuture.get(ExecutorServiceModule.java:237)
at org.jclouds.concurrent.Futures$CallGetAndRunExecutionList.run(Futures.java:59)
... 3 more
Caused by: java.util.concurrent.ExecutionException: task submitted from the following trace
at org.jclouds.concurrent.config.ExecutorServiceModule$DescribedFuture.ensureCauseHasSubmissionTrace(ExecutorServiceModule.java:270)
at org.jclouds.concurrent.config.ExecutorServiceModule$DescribedFuture.get(ExecutorServiceModule.java:241)
... 4 more
Exception in thread "user thread 224" java.lang.IllegalStateException: interrupted calling get() on [[method=LoginAsyncClient.login, request=POST https://api.symphonyvpdc.savvis.net/vpdc/v1.0/login HTTP/1.1]], so could not run listeners
at org.jclouds.concurrent.Futures$CallGetAndRunExecutionList.run(Futures.java:66)
at java.util.concurrent.ThreadPoolExecutor$Worker.runTask(ThreadPoolExecutor.java:886)
at java.util.concurrent.ThreadPoolExecutor$Worker.run(ThreadPoolExecutor.java:908)
at java.lang.Thread.run(Thread.java:680)
Caused by: java.lang.InterruptedException
at java.util.concurrent.locks.AbstractQueuedSynchronizer.doAcquireSharedInterruptibly(AbstractQueuedSynchronizer.java:979)
at java.util.concurrent.locks.AbstractQueuedSynchronizer.acquireSharedInterruptibly(AbstractQueuedSynchronizer.java:1281)
at java.util.concurrent.FutureTask$Sync.innerGet(FutureTask.java:218)
at java.util.concurrent.FutureTask.get(FutureTask.java:83)
at org.jclouds.concurrent.config.ExecutorServiceModule$DescribedFuture.get(ExecutorServiceModule.java:237)
at org.jclouds.concurrent.Futures$CallGetAndRunExecutionList.run(Futures.java:59)
... 3 more
Caused by: java.util.concurrent.ExecutionException: task submitted from the following trace
at org.jclouds.concurrent.config.ExecutorServiceModule$DescribedFuture.ensureCauseHasSubmissionTrace(ExecutorServiceModule.java:270)
at org.jclouds.concurrent.config.ExecutorServiceModule$DescribedFuture.get(ExecutorServiceModule.java:241)
... 4 more
Exception in thread "user thread 499" java.lang.IllegalStateException: interrupted calling get() on [[method=LoginAsyncClient.login, request=POST https://api.symphonyvpdc.savvis.net/vpdc/v1.0/login HTTP/1.1]], so could not run listeners
at org.jclouds.concurrent.Futures$CallGetAndRunExecutionList.run(Futures.java:66)
at java.util.concurrent.ThreadPoolExecutor$Worker.runTask(ThreadPoolExecutor.java:886)
at java.util.concurrent.ThreadPoolExecutor$Worker.run(ThreadPoolExecutor.java:908)
at java.lang.Thread.run(Thread.java:680)
Caused by: java.lang.InterruptedException
at java.util.concurrent.locks.AbstractQueuedSynchronizer.doAcquireSharedInterruptibly(AbstractQueuedSynchronizer.java:979)
at java.util.concurrent.locks.AbstractQueuedSynchronizer.acquireSharedInterruptibly(AbstractQueuedSynchronizer.java:1281)
at java.util.concurrent.FutureTask$Sync.innerGet(FutureTask.java:218)
at java.util.concurrent.FutureTask.get(FutureTask.java:83)
at org.jclouds.concurrent.config.ExecutorServiceModule$DescribedFuture.get(ExecutorServiceModule.java:237)
at org.jclouds.concurrent.Futures$CallGetAndRunExecutionList.run(Futures.java:59)
... 3 more
Caused by: java.util.concurrent.ExecutionException: task submitted from the following trace
at org.jclouds.concurrent.config.ExecutorServiceModule$DescribedFuture.ensureCauseHasSubmissionTrace(ExecutorServiceModule.java:270)
at org.jclouds.concurrent.config.ExecutorServiceModule$DescribedFuture.get(ExecutorServiceModule.java:241)
... 4 more
Exception in thread "user thread 406" java.lang.IllegalStateException: interrupted calling get() on [[method=LoginAsyncClient.login, request=POST https://api.symphonyvpdc.savvis.net/vpdc/v1.0/login HTTP/1.1]], so could not run listeners
at org.jclouds.concurrent.Futures$CallGetAndRunExecutionList.run(Futures.java:66)
at java.util.concurrent.ThreadPoolExecutor$Worker.runTask(ThreadPoolExecutor.java:886)
at java.util.concurrent.ThreadPoolExecutor$Worker.run(ThreadPoolExecutor.java:908)
at java.lang.Thread.run(Thread.java:680)
Caused by: java.lang.InterruptedException
at java.util.concurrent.locks.AbstractQueuedSynchronizer.doAcquireSharedInterruptibly(AbstractQueuedSynchronizer.java:979)
at java.util.concurrent.locks.AbstractQueuedSynchronizer.acquireSharedInterruptibly(AbstractQueuedSynchronizer.java:1281)
at java.util.concurrent.FutureTask$Sync.innerGet(FutureTask.java:218)
at java.util.concurrent.FutureTask.get(FutureTask.java:83)
at org.jclouds.concurrent.config.ExecutorServiceModule$DescribedFuture.get(ExecutorServiceModule.java:237)
at org.jclouds.concurrent.Futures$CallGetAndRunExecutionList.run(Futures.java:59)
... 3 more
Caused by: java.util.concurrent.ExecutionException: task submitted from the following trace
at org.jclouds.concurrent.config.ExecutorServiceModule$DescribedFuture.ensureCauseHasSubmissionTrace(ExecutorServiceModule.java:270)
at org.jclouds.concurrent.config.ExecutorServiceModule$DescribedFuture.get(ExecutorServiceModule.java:241)
... 4 more
Exception in thread "user thread 682" java.lang.IllegalStateException: interrupted calling get() on [[method=LoginAsyncClient.login, request=POST https://api.symphonyvpdc.savvis.net/vpdc/v1.0/login HTTP/1.1]], so could not run listeners
at org.jclouds.concurrent.Futures$CallGetAndRunExecutionList.run(Futures.java:66)
at java.util.concurrent.ThreadPoolExecutor$Worker.runTask(ThreadPoolExecutor.java:886)
at java.util.concurrent.ThreadPoolExecutor$Worker.run(ThreadPoolExecutor.java:908)
at java.lang.Thread.run(Thread.java:680)
Caused by: java.lang.InterruptedException
at java.util.concurrent.locks.AbstractQueuedSynchronizer.doAcquireSharedInterruptibly(AbstractQueuedSynchronizer.java:979)
at java.util.concurrent.locks.AbstractQueuedSynchronizer.acquireSharedInterruptibly(AbstractQueuedSynchronizer.java:1281)
at java.util.concurrent.FutureTask$Sync.innerGet(FutureTask.java:218)
at java.util.concurrent.FutureTask.get(FutureTask.java:83)
at org.jclouds.concurrent.config.ExecutorServiceModule$DescribedFuture.get(ExecutorServiceModule.java:237)
at org.jclouds.concurrent.Futures$CallGetAndRunExecutionList.run(Futures.java:59)
... 3 more
Caused by: java.util.concurrent.ExecutionException: task submitted from the following trace
at org.jclouds.concurrent.config.ExecutorServiceModule$DescribedFuture.ensureCauseHasSubmissionTrace(ExecutorServiceModule.java:270)
at org.jclouds.concurrent.config.ExecutorServiceModule$DescribedFuture.get(ExecutorServiceModule.java:241)
... 4 more
Exception in thread "user thread 494" java.lang.IllegalStateException: interrupted calling get() on [[method=LoginAsyncClient.login, request=POST https://api.symphonyvpdc.savvis.net/vpdc/v1.0/login HTTP/1.1]], so could not run listeners
at org.jclouds.concurrent.Futures$CallGetAndRunExecutionList.run(Futures.java:66)
at java.util.concurrent.ThreadPoolExecutor$Worker.runTask(ThreadPoolExecutor.java:886)
at java.util.concurrent.ThreadPoolExecutor$Worker.run(ThreadPoolExecutor.java:908)
at java.lang.Thread.run(Thread.java:680)
Caused by: java.lang.InterruptedException
at java.util.concurrent.locks.AbstractQueuedSynchronizer.doAcquireSharedInterruptibly(AbstractQueuedSynchronizer.java:979)
at java.util.concurrent.locks.AbstractQueuedSynchronizer.acquireSharedInterruptibly(AbstractQueuedSynchronizer.java:1281)
at java.util.concurrent.FutureTask$Sync.innerGet(FutureTask.java:218)
at java.util.concurrent.FutureTask.get(FutureTask.java:83)
at org.jclouds.concurrent.config.ExecutorServiceModule$DescribedFuture.get(ExecutorServiceModule.java:237)
at org.jclouds.concurrent.Futures$CallGetAndRunExecutionList.run(Futures.java:59)
... 3 more
Caused by: java.util.concurrent.ExecutionException: task submitted from the following trace
at org.jclouds.concurrent.config.ExecutorServiceModule$DescribedFuture.ensureCauseHasSubmissionTrace(ExecutorServiceModule.java:270)
at org.jclouds.concurrent.config.ExecutorServiceModule$DescribedFuture.get(ExecutorServiceModule.java:241)
... 4 more
Exception in thread "user thread 121" java.lang.IllegalStateException: interrupted calling get() on [[method=LoginAsyncClient.login, request=POST https://api.symphonyvpdc.savvis.net/vpdc/v1.0/login HTTP/1.1]], so could not run listeners
at org.jclouds.concurrent.Futures$CallGetAndRunExecutionList.run(Futures.java:66)
at java.util.concurrent.ThreadPoolExecutor$Worker.runTask(ThreadPoolExecutor.java:886)
at java.util.concurrent.ThreadPoolExecutor$Worker.run(ThreadPoolExecutor.java:908)
at java.lang.Thread.run(Thread.java:680)
Caused by: java.lang.InterruptedException
at java.util.concurrent.locks.AbstractQueuedSynchronizer.doAcquireSharedInterruptibly(AbstractQueuedSynchronizer.java:979)
at java.util.concurrent.locks.AbstractQueuedSynchronizer.acquireSharedInterruptibly(AbstractQueuedSynchronizer.java:1281)
at java.util.concurrent.FutureTask$Sync.innerGet(FutureTask.java:218)
at java.util.concurrent.FutureTask.get(FutureTask.java:83)
at org.jclouds.concurrent.config.ExecutorServiceModule$DescribedFuture.get(ExecutorServiceModule.java:237)
at org.jclouds.concurrent.Futures$CallGetAndRunExecutionList.run(Futures.java:59)
... 3 more
Caused by: java.util.concurrent.ExecutionException: task submitted from the following trace
at org.jclouds.concurrent.config.ExecutorServiceModule$DescribedFuture.ensureCauseHasSubmissionTrace(ExecutorServiceModule.java:270)
at org.jclouds.concurrent.config.ExecutorServiceModule$DescribedFuture.get(ExecutorServiceModule.java:241)
... 4 more
Exception in thread "user thread 151" java.lang.IllegalStateException: interrupted calling get() on [[method=LoginAsyncClient.login, request=POST https://api.symphonyvpdc.savvis.net/vpdc/v1.0/login HTTP/1.1]], so could not run listeners
at org.jclouds.concurrent.Futures$CallGetAndRunExecutionList.run(Futures.java:66)
at java.util.concurrent.ThreadPoolExecutor$Worker.runTask(ThreadPoolExecutor.java:886)
at java.util.concurrent.ThreadPoolExecutor$Worker.run(ThreadPoolExecutor.java:908)
at java.lang.Thread.run(Thread.java:680)
Caused by: java.lang.InterruptedException
at java.util.concurrent.locks.AbstractQueuedSynchronizer.doAcquireSharedInterruptibly(AbstractQueuedSynchronizer.java:979)
at java.util.concurrent.locks.AbstractQueuedSynchronizer.acquireSharedInterruptibly(AbstractQueuedSynchronizer.java:1281)
at java.util.concurrent.FutureTask$Sync.innerGet(FutureTask.java:218)
at java.util.concurrent.FutureTask.get(FutureTask.java:83)
at org.jclouds.concurrent.config.ExecutorServiceModule$DescribedFuture.get(ExecutorServiceModule.java:237)
at org.jclouds.concurrent.Futures$CallGetAndRunExecutionList.run(Futures.java:59)
... 3 more
Caused by: java.util.concurrent.ExecutionException: task submitted from the following trace
at org.jclouds.concurrent.config.ExecutorServiceModule$DescribedFuture.ensureCauseHasSubmissionTrace(ExecutorServiceModule.java:270)
at org.jclouds.concurrent.config.ExecutorServiceModule$DescribedFuture.get(ExecutorServiceModule.java:241)
... 4 more
Exception in thread "user thread 226" java.lang.IllegalStateException: interrupted calling get() on [[method=LoginAsyncClient.login, request=POST https://api.symphonyvpdc.savvis.net/vpdc/v1.0/login HTTP/1.1]], so could not run listeners
at org.jclouds.concurrent.Futures$CallGetAndRunExecutionList.run(Futures.java:66)
at java.util.concurrent.ThreadPoolExecutor$Worker.runTask(ThreadPoolExecutor.java:886)
at java.util.concurrent.ThreadPoolExecutor$Worker.run(ThreadPoolExecutor.java:908)
at java.lang.Thread.run(Thread.java:680)
Caused by: java.lang.InterruptedException
at java.util.concurrent.locks.AbstractQueuedSynchronizer.doAcquireSharedInterruptibly(AbstractQueuedSynchronizer.java:979)
at java.util.concurrent.locks.AbstractQueuedSynchronizer.acquireSharedInterruptibly(AbstractQueuedSynchronizer.java:1281)
at java.util.concurrent.FutureTask$Sync.innerGet(FutureTask.java:218)
at java.util.concurrent.FutureTask.get(FutureTask.java:83)
at org.jclouds.concurrent.config.ExecutorServiceModule$DescribedFuture.get(ExecutorServiceModule.java:237)
at org.jclouds.concurrent.Futures$CallGetAndRunExecutionList.run(Futures.java:59)
... 3 more
Caused by: java.util.concurrent.ExecutionException: task submitted from the following trace
at org.jclouds.concurrent.config.ExecutorServiceModule$DescribedFuture.ensureCauseHasSubmissionTrace(ExecutorServiceModule.java:270)
at org.jclouds.concurrent.config.ExecutorServiceModule$DescribedFuture.get(ExecutorServiceModule.java:241)
... 4 more
Exception in thread "user thread 435" java.lang.IllegalStateException: interrupted calling get() on [[method=LoginAsyncClient.login, request=POST https://api.symphonyvpdc.savvis.net/vpdc/v1.0/login HTTP/1.1]], so could not run listeners
at org.jclouds.concurrent.Futures$CallGetAndRunExecutionList.run(Futures.java:66)
at java.util.concurrent.ThreadPoolExecutor$Worker.runTask(ThreadPoolExecutor.java:886)
at java.util.concurrent.ThreadPoolExecutor$Worker.run(ThreadPoolExecutor.java:908)
at java.lang.Thread.run(Thread.java:680)
Caused by: java.lang.InterruptedException
at java.util.concurrent.locks.AbstractQueuedSynchronizer.doAcquireSharedInterruptibly(AbstractQueuedSynchronizer.java:979)
at java.util.concurrent.locks.AbstractQueuedSynchronizer.acquireSharedInterruptibly(AbstractQueuedSynchronizer.java:1281)
at java.util.concurrent.FutureTask$Sync.innerGet(FutureTask.java:218)
at java.util.concurrent.FutureTask.get(FutureTask.java:83)
at org.jclouds.concurrent.config.ExecutorServiceModule$DescribedFuture.get(ExecutorServiceModule.java:237)
at org.jclouds.concurrent.Futures$CallGetAndRunExecutionList.run(Futures.java:59)
... 3 more
Caused by: java.util.concurrent.ExecutionException: task submitted from the following trace
at org.jclouds.concurrent.config.ExecutorServiceModule$DescribedFuture.ensureCauseHasSubmissionTrace(ExecutorServiceModule.java:270)
at org.jclouds.concurrent.config.ExecutorServiceModule$DescribedFuture.get(ExecutorServiceModule.java:241)
... 4 more
Exception in thread "user thread 71" java.lang.IllegalStateException: interrupted calling get() on [[method=LoginAsyncClient.login, request=POST https://api.symphonyvpdc.savvis.net/vpdc/v1.0/login HTTP/1.1]], so could not run listeners
at org.jclouds.concurrent.Futures$CallGetAndRunExecutionList.run(Futures.java:66)
at java.util.concurrent.ThreadPoolExecutor$Worker.runTask(ThreadPoolExecutor.java:886)
at java.util.concurrent.ThreadPoolExecutor$Worker.run(ThreadPoolExecutor.java:908)
at java.lang.Thread.run(Thread.java:680)
Caused by: java.lang.InterruptedException
at java.util.concurrent.locks.AbstractQueuedSynchronizer.doAcquireSharedInterruptibly(AbstractQueuedSynchronizer.java:979)
at java.util.concurrent.locks.AbstractQueuedSynchronizer.acquireSharedInterruptibly(AbstractQueuedSynchronizer.java:1281)
at java.util.concurrent.FutureTask$Sync.innerGet(FutureTask.java:218)
at java.util.concurrent.FutureTask.get(FutureTask.java:83)
at org.jclouds.concurrent.config.ExecutorServiceModule$DescribedFuture.get(ExecutorServiceModule.java:237)
at org.jclouds.concurrent.Futures$CallGetAndRunExecutionList.run(Futures.java:59)
... 3 more
Caused by: java.util.concurrent.ExecutionException: task submitted from the following trace
at org.jclouds.concurrent.config.ExecutorServiceModule$DescribedFuture.ensureCauseHasSubmissionTrace(ExecutorServiceModule.java:270)
at org.jclouds.concurrent.config.ExecutorServiceModule$DescribedFuture.get(ExecutorServiceModule.java:241)
... 4 more
Exception in thread "user thread 602" java.lang.IllegalStateException: interrupted calling get() on [[method=LoginAsyncClient.login, request=POST https://api.symphonyvpdc.savvis.net/vpdc/v1.0/login HTTP/1.1]], so could not run listeners
at org.jclouds.concurrent.Futures$CallGetAndRunExecutionList.run(Futures.java:66)
at java.util.concurrent.ThreadPoolExecutor$Worker.runTask(ThreadPoolExecutor.java:886)
at java.util.concurrent.ThreadPoolExecutor$Worker.run(ThreadPoolExecutor.java:908)
at java.lang.Thread.run(Thread.java:680)
Caused by: java.lang.InterruptedException
at java.util.concurrent.locks.AbstractQueuedSynchronizer.doAcquireSharedInterruptibly(AbstractQueuedSynchronizer.java:979)
at java.util.concurrent.locks.AbstractQueuedSynchronizer.acquireSharedInterruptibly(AbstractQueuedSynchronizer.java:1281)
at java.util.concurrent.FutureTask$Sync.innerGet(FutureTask.java:218)
at java.util.concurrent.FutureTask.get(FutureTask.java:83)
at org.jclouds.concurrent.config.ExecutorServiceModule$DescribedFuture.get(ExecutorServiceModule.java:237)
at org.jclouds.concurrent.Futures$CallGetAndRunExecutionList.run(Futures.java:59)
... 3 more
Caused by: java.util.concurrent.ExecutionException: task submitted from the following trace
at org.jclouds.concurrent.config.ExecutorServiceModule$DescribedFuture.ensureCauseHasSubmissionTrace(ExecutorServiceModule.java:270)
at org.jclouds.concurrent.config.ExecutorServiceModule$DescribedFuture.get(ExecutorServiceModule.java:241)
... 4 more
Exception in thread "user thread 434" java.lang.IllegalStateException: interrupted calling get() on [[method=LoginAsyncClient.login, request=POST https://api.symphonyvpdc.savvis.net/vpdc/v1.0/login HTTP/1.1]], so could not run listeners
at org.jclouds.concurrent.Futures$CallGetAndRunExecutionList.run(Futures.java:66)
at java.util.concurrent.ThreadPoolExecutor$Worker.runTask(ThreadPoolExecutor.java:886)
at java.util.concurrent.ThreadPoolExecutor$Worker.run(ThreadPoolExecutor.java:908)
at java.lang.Thread.run(Thread.java:680)
Caused by: java.lang.InterruptedException
at java.util.concurrent.locks.AbstractQueuedSynchronizer.doAcquireSharedInterruptibly(AbstractQueuedSynchronizer.java:979)
at java.util.concurrent.locks.AbstractQueuedSynchronizer.acquireSharedInterruptibly(AbstractQueuedSynchronizer.java:1281)
at java.util.concurrent.FutureTask$Sync.innerGet(FutureTask.java:218)
at java.util.concurrent.FutureTask.get(FutureTask.java:83)
at org.jclouds.concurrent.config.ExecutorServiceModule$DescribedFuture.get(ExecutorServiceModule.java:237)
at org.jclouds.concurrent.Futures$CallGetAndRunExecutionList.run(Futures.java:59)
... 3 more
Caused by: java.util.concurrent.ExecutionException: task submitted from the following trace
at org.jclouds.concurrent.config.ExecutorServiceModule$DescribedFuture.ensureCauseHasSubmissionTrace(ExecutorServiceModule.java:270)
at org.jclouds.concurrent.config.ExecutorServiceModule$DescribedFuture.get(ExecutorServiceModule.java:241)
... 4 more
Exception in thread "user thread 56" java.lang.IllegalStateException: interrupted calling get() on [[method=LoginAsyncClient.login, request=POST https://api.symphonyvpdc.savvis.net/vpdc/v1.0/login HTTP/1.1]], so could not run listeners
at org.jclouds.concurrent.Futures$CallGetAndRunExecutionList.run(Futures.java:66)
at java.util.concurrent.ThreadPoolExecutor$Worker.runTask(ThreadPoolExecutor.java:886)
at java.util.concurrent.ThreadPoolExecutor$Worker.run(ThreadPoolExecutor.java:908)
at java.lang.Thread.run(Thread.java:680)
Caused by: java.lang.InterruptedException
at java.util.concurrent.locks.AbstractQueuedSynchronizer.doAcquireSharedInterruptibly(AbstractQueuedSynchronizer.java:979)
at java.util.concurrent.locks.AbstractQueuedSynchronizer.acquireSharedInterruptibly(AbstractQueuedSynchronizer.java:1281)
at java.util.concurrent.FutureTask$Sync.innerGet(FutureTask.java:218)
at java.util.concurrent.FutureTask.get(FutureTask.java:83)
at org.jclouds.concurrent.config.ExecutorServiceModule$DescribedFuture.get(ExecutorServiceModule.java:237)
at org.jclouds.concurrent.Futures$CallGetAndRunExecutionList.run(Futures.java:59)
... 3 more
Caused by: java.util.concurrent.ExecutionException: task submitted from the following trace
at org.jclouds.concurrent.config.ExecutorServiceModule$DescribedFuture.ensureCauseHasSubmissionTrace(ExecutorServiceModule.java:270)
at org.jclouds.concurrent.config.ExecutorServiceModule$DescribedFuture.get(ExecutorServiceModule.java:241)
... 4 more
Exception in thread "user thread 63" java.lang.IllegalStateException: interrupted calling get() on [[method=LoginAsyncClient.login, request=POST https://api.symphonyvpdc.savvis.net/vpdc/v1.0/login HTTP/1.1]], so could not run listeners
at org.jclouds.concurrent.Futures$CallGetAndRunExecutionList.run(Futures.java:66)
at java.util.concurrent.ThreadPoolExecutor$Worker.runTask(ThreadPoolExecutor.java:886)
at java.util.concurrent.ThreadPoolExecutor$Worker.run(ThreadPoolExecutor.java:908)
at java.lang.Thread.run(Thread.java:680)
Caused by: java.lang.InterruptedException
at java.util.concurrent.locks.AbstractQueuedSynchronizer.doAcquireSharedInterruptibly(AbstractQueuedSynchronizer.java:979)
at java.util.concurrent.locks.AbstractQueuedSynchronizer.acquireSharedInterruptibly(AbstractQueuedSynchronizer.java:1281)
at java.util.concurrent.FutureTask$Sync.innerGet(FutureTask.java:218)
at java.util.concurrent.FutureTask.get(FutureTask.java:83)
at org.jclouds.concurrent.config.ExecutorServiceModule$DescribedFuture.get(ExecutorServiceModule.java:237)
at org.jclouds.concurrent.Futures$CallGetAndRunExecutionList.run(Futures.java:59)
... 3 more
Caused by: java.util.concurrent.ExecutionException: task submitted from the following trace
at org.jclouds.concurrent.config.ExecutorServiceModule$DescribedFuture.ensureCauseHasSubmissionTrace(ExecutorServiceModule.java:270)
at org.jclouds.concurrent.config.ExecutorServiceModule$DescribedFuture.get(ExecutorServiceModule.java:241)
... 4 more
Exception in thread "user thread 476" java.lang.IllegalStateException: interrupted calling get() on [[method=LoginAsyncClient.login, request=POST https://api.symphonyvpdc.savvis.net/vpdc/v1.0/login HTTP/1.1]], so could not run listeners
at org.jclouds.concurrent.Futures$CallGetAndRunExecutionList.run(Futures.java:66)
at java.util.concurrent.ThreadPoolExecutor$Worker.runTask(ThreadPoolExecutor.java:886)
at java.util.concurrent.ThreadPoolExecutor$Worker.run(ThreadPoolExecutor.java:908)
at java.lang.Thread.run(Thread.java:680)
Caused by: java.lang.InterruptedException
at java.util.concurrent.locks.AbstractQueuedSynchronizer.doAcquireSharedInterruptibly(AbstractQueuedSynchronizer.java:979)
at java.util.concurrent.locks.AbstractQueuedSynchronizer.acquireSharedInterruptibly(AbstractQueuedSynchronizer.java:1281)
at java.util.concurrent.FutureTask$Sync.innerGet(FutureTask.java:218)
at java.util.concurrent.FutureTask.get(FutureTask.java:83)
at org.jclouds.concurrent.config.ExecutorServiceModule$DescribedFuture.get(ExecutorServiceModule.java:237)
at org.jclouds.concurrent.Futures$CallGetAndRunExecutionList.run(Futures.java:59)
... 3 more
Caused by: java.util.concurrent.ExecutionException: task submitted from the following trace
at org.jclouds.concurrent.config.ExecutorServiceModule$DescribedFuture.ensureCauseHasSubmissionTrace(ExecutorServiceModule.java:270)
at org.jclouds.concurrent.config.ExecutorServiceModule$DescribedFuture.get(ExecutorServiceModule.java:241)
... 4 more
Exception in thread "user thread 195" java.lang.IllegalStateException: interrupted calling get() on [[method=LoginAsyncClient.login, request=POST https://api.symphonyvpdc.savvis.net/vpdc/v1.0/login HTTP/1.1]], so could not run listeners
at org.jclouds.concurrent.Futures$CallGetAndRunExecutionList.run(Futures.java:66)
at java.util.concurrent.ThreadPoolExecutor$Worker.runTask(ThreadPoolExecutor.java:886)
at java.util.concurrent.ThreadPoolExecutor$Worker.run(ThreadPoolExecutor.java:908)
at java.lang.Thread.run(Thread.java:680)
Caused by: java.lang.InterruptedException
at java.util.concurrent.locks.AbstractQueuedSynchronizer.doAcquireSharedInterruptibly(AbstractQueuedSynchronizer.java:979)
at java.util.concurrent.locks.AbstractQueuedSynchronizer.acquireSharedInterruptibly(AbstractQueuedSynchronizer.java:1281)
at java.util.concurrent.FutureTask$Sync.innerGet(FutureTask.java:218)
at java.util.concurrent.FutureTask.get(FutureTask.java:83)
at org.jclouds.concurrent.config.ExecutorServiceModule$DescribedFuture.get(ExecutorServiceModule.java:237)
at org.jclouds.concurrent.Futures$CallGetAndRunExecutionList.run(Futures.java:59)
... 3 more
Caused by: java.util.concurrent.ExecutionException: task submitted from the following trace
at org.jclouds.concurrent.config.ExecutorServiceModule$DescribedFuture.ensureCauseHasSubmissionTrace(ExecutorServiceModule.java:270)
at org.jclouds.concurrent.config.ExecutorServiceModule$DescribedFuture.get(ExecutorServiceModule.java:241)
... 4 more
Exception in thread "user thread 640" java.lang.IllegalStateException: interrupted calling get() on [[method=LoginAsyncClient.login, request=POST https://api.symphonyvpdc.savvis.net/vpdc/v1.0/login HTTP/1.1]], so could not run listeners
at org.jclouds.concurrent.Futures$CallGetAndRunExecutionList.run(Futures.java:66)
at java.util.concurrent.ThreadPoolExecutor$Worker.runTask(ThreadPoolExecutor.java:886)
at java.util.concurrent.ThreadPoolExecutor$Worker.run(ThreadPoolExecutor.java:908)
at java.lang.Thread.run(Thread.java:680)
Caused by: java.lang.InterruptedException
at java.util.concurrent.locks.AbstractQueuedSynchronizer.doAcquireSharedInterruptibly(AbstractQueuedSynchronizer.java:979)
at java.util.concurrent.locks.AbstractQueuedSynchronizer.acquireSharedInterruptibly(AbstractQueuedSynchronizer.java:1281)
at java.util.concurrent.FutureTask$Sync.innerGet(FutureTask.java:218)
at java.util.concurrent.FutureTask.get(FutureTask.java:83)
at org.jclouds.concurrent.config.ExecutorServiceModule$DescribedFuture.get(ExecutorServiceModule.java:237)
at org.jclouds.concurrent.Futures$CallGetAndRunExecutionList.run(Futures.java:59)
... 3 more
Caused by: java.util.concurrent.ExecutionException: task submitted from the following trace
at org.jclouds.concurrent.config.ExecutorServiceModule$DescribedFuture.ensureCauseHasSubmissionTrace(ExecutorServiceModule.java:270)
at org.jclouds.concurrent.config.ExecutorServiceModule$DescribedFuture.get(ExecutorServiceModule.java:241)
... 4 more
Exception in thread "user thread 183" java.lang.IllegalStateException: interrupted calling get() on [[method=LoginAsyncClient.login, request=POST https://api.symphonyvpdc.savvis.net/vpdc/v1.0/login HTTP/1.1]], so could not run listeners
at org.jclouds.concurrent.Futures$CallGetAndRunExecutionList.run(Futures.java:66)
at java.util.concurrent.ThreadPoolExecutor$Worker.runTask(ThreadPoolExecutor.java:886)
at java.util.concurrent.ThreadPoolExecutor$Worker.run(ThreadPoolExecutor.java:908)
at java.lang.Thread.run(Thread.java:680)
Caused by: java.lang.InterruptedException
at java.util.concurrent.locks.AbstractQueuedSynchronizer.doAcquireSharedInterruptibly(AbstractQueuedSynchronizer.java:979)
at java.util.concurrent.locks.AbstractQueuedSynchronizer.acquireSharedInterruptibly(AbstractQueuedSynchronizer.java:1281)
at java.util.concurrent.FutureTask$Sync.innerGet(FutureTask.java:218)
at java.util.concurrent.FutureTask.get(FutureTask.java:83)
at org.jclouds.concurrent.config.ExecutorServiceModule$DescribedFuture.get(ExecutorServiceModule.java:237)
at org.jclouds.concurrent.Futures$CallGetAndRunExecutionList.run(Futures.java:59)
... 3 more
Caused by: java.util.concurrent.ExecutionException: task submitted from the following trace
at org.jclouds.concurrent.config.ExecutorServiceModule$DescribedFuture.ensureCauseHasSubmissionTrace(ExecutorServiceModule.java:270)
at org.jclouds.concurrent.config.ExecutorServiceModule$DescribedFuture.get(ExecutorServiceModule.java:241)
... 4 more
Exception in thread "user thread 571" java.lang.IllegalStateException: interrupted calling get() on [[method=LoginAsyncClient.login, request=POST https://api.symphonyvpdc.savvis.net/vpdc/v1.0/login HTTP/1.1]], so could not run listeners
at org.jclouds.concurrent.Futures$CallGetAndRunExecutionList.run(Futures.java:66)
at java.util.concurrent.ThreadPoolExecutor$Worker.runTask(ThreadPoolExecutor.java:886)
at java.util.concurrent.ThreadPoolExecutor$Worker.run(ThreadPoolExecutor.java:908)
at java.lang.Thread.run(Thread.java:680)
Caused by: java.lang.InterruptedException
at java.util.concurrent.locks.AbstractQueuedSynchronizer.doAcquireSharedInterruptibly(AbstractQueuedSynchronizer.java:979)
at java.util.concurrent.locks.AbstractQueuedSynchronizer.acquireSharedInterruptibly(AbstractQueuedSynchronizer.java:1281)
at java.util.concurrent.FutureTask$Sync.innerGet(FutureTask.java:218)
at java.util.concurrent.FutureTask.get(FutureTask.java:83)
at org.jclouds.concurrent.config.ExecutorServiceModule$DescribedFuture.get(ExecutorServiceModule.java:237)
at org.jclouds.concurrent.Futures$CallGetAndRunExecutionList.run(Futures.java:59)
... 3 more
Caused by: java.util.concurrent.ExecutionException: task submitted from the following trace
at org.jclouds.concurrent.config.ExecutorServiceModule$DescribedFuture.ensureCauseHasSubmissionTrace(ExecutorServiceModule.java:270)
at org.jclouds.concurrent.config.ExecutorServiceModule$DescribedFuture.get(ExecutorServiceModule.java:241)
... 4 more
Exception in thread "user thread 363" java.lang.IllegalStateException: interrupted calling get() on [[method=LoginAsyncClient.login, request=POST https://api.symphonyvpdc.savvis.net/vpdc/v1.0/login HTTP/1.1]], so could not run listeners
at org.jclouds.concurrent.Futures$CallGetAndRunExecutionList.run(Futures.java:66)
at java.util.concurrent.ThreadPoolExecutor$Worker.runTask(ThreadPoolExecutor.java:886)
at java.util.concurrent.ThreadPoolExecutor$Worker.run(ThreadPoolExecutor.java:908)
at java.lang.Thread.run(Thread.java:680)
Caused by: java.lang.InterruptedException
at java.util.concurrent.locks.AbstractQueuedSynchronizer.doAcquireSharedInterruptibly(AbstractQueuedSynchronizer.java:979)
at java.util.concurrent.locks.AbstractQueuedSynchronizer.acquireSharedInterruptibly(AbstractQueuedSynchronizer.java:1281)
at java.util.concurrent.FutureTask$Sync.innerGet(FutureTask.java:218)
at java.util.concurrent.FutureTask.get(FutureTask.java:83)
at org.jclouds.concurrent.config.ExecutorServiceModule$DescribedFuture.get(ExecutorServiceModule.java:237)
at org.jclouds.concurrent.Futures$CallGetAndRunExecutionList.run(Futures.java:59)
... 3 more
Caused by: java.util.concurrent.ExecutionException: task submitted from the following trace
at org.jclouds.concurrent.config.ExecutorServiceModule$DescribedFuture.ensureCauseHasSubmissionTrace(ExecutorServiceModule.java:270)
at org.jclouds.concurrent.config.ExecutorServiceModule$DescribedFuture.get(ExecutorServiceModule.java:241)
... 4 more
Exception in thread "user thread 218" java.lang.IllegalStateException: interrupted calling get() on [[method=LoginAsyncClient.login, request=POST https://api.symphonyvpdc.savvis.net/vpdc/v1.0/login HTTP/1.1]], so could not run listeners
at org.jclouds.concurrent.Futures$CallGetAndRunExecutionList.run(Futures.java:66)
at java.util.concurrent.ThreadPoolExecutor$Worker.runTask(ThreadPoolExecutor.java:886)
at java.util.concurrent.ThreadPoolExecutor$Worker.run(ThreadPoolExecutor.java:908)
at java.lang.Thread.run(Thread.java:680)
Caused by: java.lang.InterruptedException
at java.util.concurrent.locks.AbstractQueuedSynchronizer.doAcquireSharedInterruptibly(AbstractQueuedSynchronizer.java:979)
at java.util.concurrent.locks.AbstractQueuedSynchronizer.acquireSharedInterruptibly(AbstractQueuedSynchronizer.java:1281)
at java.util.concurrent.FutureTask$Sync.innerGet(FutureTask.java:218)
at java.util.concurrent.FutureTask.get(FutureTask.java:83)
at org.jclouds.concurrent.config.ExecutorServiceModule$DescribedFuture.get(ExecutorServiceModule.java:237)
at org.jclouds.concurrent.Futures$CallGetAndRunExecutionList.run(Futures.java:59)
... 3 more
Caused by: java.util.concurrent.ExecutionException: task submitted from the following trace
at org.jclouds.concurrent.config.ExecutorServiceModule$DescribedFuture.ensureCauseHasSubmissionTrace(ExecutorServiceModule.java:270)
at org.jclouds.concurrent.config.ExecutorServiceModule$DescribedFuture.get(ExecutorServiceModule.java:241)
... 4 more
Exception in thread "user thread 94" java.lang.IllegalStateException: interrupted calling get() on [[method=LoginAsyncClient.login, request=POST https://api.symphonyvpdc.savvis.net/vpdc/v1.0/login HTTP/1.1]], so could not run listeners
at org.jclouds.concurrent.Futures$CallGetAndRunExecutionList.run(Futures.java:66)
at java.util.concurrent.ThreadPoolExecutor$Worker.runTask(ThreadPoolExecutor.java:886)
at java.util.concurrent.ThreadPoolExecutor$Worker.run(ThreadPoolExecutor.java:908)
at java.lang.Thread.run(Thread.java:680)
Caused by: java.lang.InterruptedException
at java.util.concurrent.locks.AbstractQueuedSynchronizer.doAcquireSharedInterruptibly(AbstractQueuedSynchronizer.java:979)
at java.util.concurrent.locks.AbstractQueuedSynchronizer.acquireSharedInterruptibly(AbstractQueuedSynchronizer.java:1281)
at java.util.concurrent.FutureTask$Sync.innerGet(FutureTask.java:218)
at java.util.concurrent.FutureTask.get(FutureTask.java:83)
at org.jclouds.concurrent.config.ExecutorServiceModule$DescribedFuture.get(ExecutorServiceModule.java:237)
at org.jclouds.concurrent.Futures$CallGetAndRunExecutionList.run(Futures.java:59)
... 3 more
Caused by: java.util.concurrent.ExecutionException: task submitted from the following trace
at org.jclouds.concurrent.config.ExecutorServiceModule$DescribedFuture.ensureCauseHasSubmissionTrace(ExecutorServiceModule.java:270)
at org.jclouds.concurrent.config.ExecutorServiceModule$DescribedFuture.get(ExecutorServiceModule.java:241)
... 4 more
Exception in thread "user thread 106" java.lang.IllegalStateException: interrupted calling get() on [[method=LoginAsyncClient.login, request=POST https://api.symphonyvpdc.savvis.net/vpdc/v1.0/login HTTP/1.1]], so could not run listeners
at org.jclouds.concurrent.Futures$CallGetAndRunExecutionList.run(Futures.java:66)
at java.util.concurrent.ThreadPoolExecutor$Worker.runTask(ThreadPoolExecutor.java:886)
at java.util.concurrent.ThreadPoolExecutor$Worker.run(ThreadPoolExecutor.java:908)
at java.lang.Thread.run(Thread.java:680)
Caused by: java.lang.InterruptedException
at java.util.concurrent.locks.AbstractQueuedSynchronizer.doAcquireSharedInterruptibly(AbstractQueuedSynchronizer.java:979)
at java.util.concurrent.locks.AbstractQueuedSynchronizer.acquireSharedInterruptibly(AbstractQueuedSynchronizer.java:1281)
at java.util.concurrent.FutureTask$Sync.innerGet(FutureTask.java:218)
at java.util.concurrent.FutureTask.get(FutureTask.java:83)
at org.jclouds.concurrent.config.ExecutorServiceModule$DescribedFuture.get(ExecutorServiceModule.java:237)
at org.jclouds.concurrent.Futures$CallGetAndRunExecutionList.run(Futures.java:59)
... 3 more
Caused by: java.util.concurrent.ExecutionException: task submitted from the following trace
at org.jclouds.concurrent.config.ExecutorServiceModule$DescribedFuture.ensureCauseHasSubmissionTrace(ExecutorServiceModule.java:270)
at org.jclouds.concurrent.config.ExecutorServiceModule$DescribedFuture.get(ExecutorServiceModule.java:241)
... 4 more
Exception in thread "user thread 269" java.lang.IllegalStateException: interrupted calling get() on [[method=LoginAsyncClient.login, request=POST https://api.symphonyvpdc.savvis.net/vpdc/v1.0/login HTTP/1.1]], so could not run listeners
at org.jclouds.concurrent.Futures$CallGetAndRunExecutionList.run(Futures.java:66)
at java.util.concurrent.ThreadPoolExecutor$Worker.runTask(ThreadPoolExecutor.java:886)
at java.util.concurrent.ThreadPoolExecutor$Worker.run(ThreadPoolExecutor.java:908)
at java.lang.Thread.run(Thread.java:680)
Caused by: java.lang.InterruptedException
at java.util.concurrent.locks.AbstractQueuedSynchronizer.doAcquireSharedInterruptibly(AbstractQueuedSynchronizer.java:979)
at java.util.concurrent.locks.AbstractQueuedSynchronizer.acquireSharedInterruptibly(AbstractQueuedSynchronizer.java:1281)
at java.util.concurrent.FutureTask$Sync.innerGet(FutureTask.java:218)
at java.util.concurrent.FutureTask.get(FutureTask.java:83)
at org.jclouds.concurrent.config.ExecutorServiceModule$DescribedFuture.get(ExecutorServiceModule.java:237)
at org.jclouds.concurrent.Futures$CallGetAndRunExecutionList.run(Futures.java:59)
... 3 more
Caused by: java.util.concurrent.ExecutionException: task submitted from the following trace
at org.jclouds.concurrent.config.ExecutorServiceModule$DescribedFuture.ensureCauseHasSubmissionTrace(ExecutorServiceModule.java:270)
at org.jclouds.concurrent.config.ExecutorServiceModule$DescribedFuture.get(ExecutorServiceModule.java:241)
... 4 more
Exception in thread "user thread 650" java.lang.IllegalStateException: interrupted calling get() on [[method=LoginAsyncClient.login, request=POST https://api.symphonyvpdc.savvis.net/vpdc/v1.0/login HTTP/1.1]], so could not run listeners
at org.jclouds.concurrent.Futures$CallGetAndRunExecutionList.run(Futures.java:66)
at java.util.concurrent.ThreadPoolExecutor$Worker.runTask(ThreadPoolExecutor.java:886)
at java.util.concurrent.ThreadPoolExecutor$Worker.run(ThreadPoolExecutor.java:908)
at java.lang.Thread.run(Thread.java:680)
Caused by: java.lang.InterruptedException
at java.util.concurrent.locks.AbstractQueuedSynchronizer.doAcquireSharedInterruptibly(AbstractQueuedSynchronizer.java:979)
at java.util.concurrent.locks.AbstractQueuedSynchronizer.acquireSharedInterruptibly(AbstractQueuedSynchronizer.java:1281)
at java.util.concurrent.FutureTask$Sync.innerGet(FutureTask.java:218)
at java.util.concurrent.FutureTask.get(FutureTask.java:83)
at org.jclouds.concurrent.config.ExecutorServiceModule$DescribedFuture.get(ExecutorServiceModule.java:237)
at org.jclouds.concurrent.Futures$CallGetAndRunExecutionList.run(Futures.java:59)
... 3 more
Caused by: java.util.concurrent.ExecutionException: task submitted from the following trace
at org.jclouds.concurrent.config.ExecutorServiceModule$DescribedFuture.ensureCauseHasSubmissionTrace(ExecutorServiceModule.java:270)
at org.jclouds.concurrent.config.ExecutorServiceModule$DescribedFuture.get(ExecutorServiceModule.java:241)
... 4 more
Exception in thread "user thread 557" java.lang.IllegalStateException: interrupted calling get() on [[method=LoginAsyncClient.login, request=POST https://api.symphonyvpdc.savvis.net/vpdc/v1.0/login HTTP/1.1]], so could not run listeners
at org.jclouds.concurrent.Futures$CallGetAndRunExecutionList.run(Futures.java:66)
at java.util.concurrent.ThreadPoolExecutor$Worker.runTask(ThreadPoolExecutor.java:886)
at java.util.concurrent.ThreadPoolExecutor$Worker.run(ThreadPoolExecutor.java:908)
at java.lang.Thread.run(Thread.java:680)
Caused by: java.lang.InterruptedException
at java.util.concurrent.locks.AbstractQueuedSynchronizer.doAcquireSharedInterruptibly(AbstractQueuedSynchronizer.java:979)
at java.util.concurrent.locks.AbstractQueuedSynchronizer.acquireSharedInterruptibly(AbstractQueuedSynchronizer.java:1281)
at java.util.concurrent.FutureTask$Sync.innerGet(FutureTask.java:218)
at java.util.concurrent.FutureTask.get(FutureTask.java:83)
at org.jclouds.concurrent.config.ExecutorServiceModule$DescribedFuture.get(ExecutorServiceModule.java:237)
at org.jclouds.concurrent.Futures$CallGetAndRunExecutionList.run(Futures.java:59)
... 3 more
Caused by: java.util.concurrent.ExecutionException: task submitted from the following trace
at org.jclouds.concurrent.config.ExecutorServiceModule$DescribedFuture.ensureCauseHasSubmissionTrace(ExecutorServiceModule.java:270)
at org.jclouds.concurrent.config.ExecutorServiceModule$DescribedFuture.get(ExecutorServiceModule.java:241)
... 4 more
Exception in thread "user thread 46" java.lang.IllegalStateException: interrupted calling get() on [[method=LoginAsyncClient.login, request=POST https://api.symphonyvpdc.savvis.net/vpdc/v1.0/login HTTP/1.1]], so could not run listeners
at org.jclouds.concurrent.Futures$CallGetAndRunExecutionList.run(Futures.java:66)
at java.util.concurrent.ThreadPoolExecutor$Worker.runTask(ThreadPoolExecutor.java:886)
at java.util.concurrent.ThreadPoolExecutor$Worker.run(ThreadPoolExecutor.java:908)
at java.lang.Thread.run(Thread.java:680)
Caused by: java.lang.InterruptedException
at java.util.concurrent.locks.AbstractQueuedSynchronizer.doAcquireSharedInterruptibly(AbstractQueuedSynchronizer.java:979)
at java.util.concurrent.locks.AbstractQueuedSynchronizer.acquireSharedInterruptibly(AbstractQueuedSynchronizer.java:1281)
at java.util.concurrent.FutureTask$Sync.innerGet(FutureTask.java:218)
at java.util.concurrent.FutureTask.get(FutureTask.java:83)
at org.jclouds.concurrent.config.ExecutorServiceModule$DescribedFuture.get(ExecutorServiceModule.java:237)
at org.jclouds.concurrent.Futures$CallGetAndRunExecutionList.run(Futures.java:59)
... 3 more
Caused by: java.util.concurrent