blob: 78f7a9f795d6a1abd9f66132566b83fc9f9649f2 [file] [log] [blame]
-------------------------------------------------------------------------------
Test set: TestSuite
-------------------------------------------------------------------------------
Tests run: 116, Failures: 9, Errors: 0, Skipped: 8, Time elapsed: 270.477 sec <<< FAILURE!
testCreateAndRunAService(org.jclouds.rimuhosting.miro.compute.RimuHostingComputeServiceLiveTest) Time elapsed: 2.119 sec <<< FAILURE!
org.jclouds.compute.RunNodesException: error running 1 node group(rimuhosting.jcloudss) location(DCDALLAS) image(ubuntu1110.64) size(MIRO4B) options([inboundPorts=[22, 8080], privateKey=false, publicKey=false, runScript=false, blockUntilRunning=true, blockOnComplete=true, port:seconds=22:300, userMetadata: {Name=rimuhosting.jcloudss}])
Execution failures:
1) ExecutionException on rimuhosting.jcloudss-e14:
java.util.concurrent.ExecutionException: org.jclouds.http.HttpResponseException: command: POST https://api.rimuhosting.com/r/orders/new-vps HTTP/1.1 failed with response: HTTP/1.1 406 Not Acceptable; content: [{ "post_new_vps_response" : { "status_message" : "Not Acceptable"
, "status_code" : 406
, "response_created_time" : { "ms_since_epoch": 1326650755041, "iso_format" : "2012-01-15T18:05:55Z", "users_tz_offset_ms" : 46800000}
, "response_created_time_epoch_ms" : 1326650755041
, "error_info" : { "error_class" : "ValidationError"
, "full_error_message" : "memory_mb: The 64 bit distros require a good amount of memory. Try 256MB or more."
, "human_readable_message" : "The 64 bit distros require a good amount of memory. Try 256MB or more."
, "error_title" : "Validation Problem"
, "field_name" : "memory_mb"}
, "extended_error_infos" : [{ "error_class" : "ValidationError"
, "full_error_message" : "memory_mb: The 64 bit distros require a good amount of memory. Try 256MB or more."
, "human_readable_message" : "The 64 bit distros require a good amount of memory. Try 256MB or more."
, "error_title" : "Validation Problem"
, "field_name" : "memory_mb"}]
, "response_type" : "ERROR"
, "human_readable_message" : "The 64 bit distros require a good amount of memory. Try 256MB or more."
, "redirect_uri" : null
, "response_display_duration_type" : "REGULAR"
, "setup_messages" : ["Selected user as the logged in user: Ivan Meredith"
, "Selected billing details as the first 'wire' billing details found for the user: Wire Transfer"
, "No VPS paramters provided, using default values."
, "'memory_mb' not provided, setting to 160MB."
, "'disk_space_mb' not provided, setting to 4GB."
, "memory_mb: The 64 bit distros require a good amount of memory. Try 256MB or more."]
, "about_order" : null
, "new_order_request" : { "billing_oid" : 0
, "user_oid" : 0
, "host_server_oid" : null
, "ip_request" : null
, "vps_parameters" : null
, "pricing_plan_code" : "MIRO4B"
, "dc_location" : null
, "vps_type" : null
, "instantiation_options" : { "domain_name" : "rimuhosting.jcloudss-e14"
, "control_panel" : "none"
, "password" : "fuyekeza22"
, "distro" : "ubuntu1110.64"}
, "instantiation_via_clone_options" : null
, "file_injection_data" : null
, "meta_data" : []}
, "running_vps_info" : null}}
]
at com.google.common.util.concurrent.AbstractFuture$Sync.getValue(AbstractFuture.java:289)
at com.google.common.util.concurrent.AbstractFuture$Sync.get(AbstractFuture.java:276)
at com.google.common.util.concurrent.AbstractFuture.get(AbstractFuture.java:111)
at com.google.common.util.concurrent.Futures$ChainingListenableFuture.get(Futures.java:635)
at org.jclouds.concurrent.FutureIterables$1.run(FutureIterables.java:126)
at java.util.concurrent.ThreadPoolExecutor$Worker.runTask(ThreadPoolExecutor.java:886)
at java.util.concurrent.ThreadPoolExecutor$Worker.run(ThreadPoolExecutor.java:908)
at java.lang.Thread.run(Thread.java:680)
Caused by: org.jclouds.http.HttpResponseException: command: POST https://api.rimuhosting.com/r/orders/new-vps HTTP/1.1 failed with response: HTTP/1.1 406 Not Acceptable; content: [{ "post_new_vps_response" : { "status_message" : "Not Acceptable"
, "status_code" : 406
, "response_created_time" : { "ms_since_epoch": 1326650755041, "iso_format" : "2012-01-15T18:05:55Z", "users_tz_offset_ms" : 46800000}
, "response_created_time_epoch_ms" : 1326650755041
, "error_info" : { "error_class" : "ValidationError"
, "full_error_message" : "memory_mb: The 64 bit distros require a good amount of memory. Try 256MB or more."
, "human_readable_message" : "The 64 bit distros require a good amount of memory. Try 256MB or more."
, "error_title" : "Validation Problem"
, "field_name" : "memory_mb"}
, "extended_error_infos" : [{ "error_class" : "ValidationError"
, "full_error_message" : "memory_mb: The 64 bit distros require a good amount of memory. Try 256MB or more."
, "human_readable_message" : "The 64 bit distros require a good amount of memory. Try 256MB or more."
, "error_title" : "Validation Problem"
, "field_name" : "memory_mb"}]
, "response_type" : "ERROR"
, "human_readable_message" : "The 64 bit distros require a good amount of memory. Try 256MB or more."
, "redirect_uri" : null
, "response_display_duration_type" : "REGULAR"
, "setup_messages" : ["Selected user as the logged in user: Ivan Meredith"
, "Selected billing details as the first 'wire' billing details found for the user: Wire Transfer"
, "No VPS paramters provided, using default values."
, "'memory_mb' not provided, setting to 160MB."
, "'disk_space_mb' not provided, setting to 4GB."
, "memory_mb: The 64 bit distros require a good amount of memory. Try 256MB or more."]
, "about_order" : null
, "new_order_request" : { "billing_oid" : 0
, "user_oid" : 0
, "host_server_oid" : null
, "ip_request" : null
, "vps_parameters" : null
, "pricing_plan_code" : "MIRO4B"
, "dc_location" : null
, "vps_type" : null
, "instantiation_options" : { "domain_name" : "rimuhosting.jcloudss-e14"
, "control_panel" : "none"
, "password" : "fuyekeza22"
, "distro" : "ubuntu1110.64"}
, "instantiation_via_clone_options" : null
, "file_injection_data" : null
, "meta_data" : []}
, "running_vps_info" : null}}
]
at org.jclouds.http.handlers.CloseContentAndSetExceptionErrorHandler.handleError(CloseContentAndSetExceptionErrorHandler.java:44)
at org.jclouds.http.handlers.DelegatingErrorHandler.handleError(DelegatingErrorHandler.java:69)
at org.jclouds.http.internal.BaseHttpCommandExecutorService$HttpResponseCallable.shouldContinue(BaseHttpCommandExecutorService.java:200)
at org.jclouds.http.internal.BaseHttpCommandExecutorService$HttpResponseCallable.call(BaseHttpCommandExecutorService.java:165)
at org.jclouds.http.internal.BaseHttpCommandExecutorService$HttpResponseCallable.call(BaseHttpCommandExecutorService.java:134)
at java.util.concurrent.FutureTask$Sync.innerRun(FutureTask.java:303)
at java.util.concurrent.FutureTask.run(FutureTask.java:138)
at java.util.concurrent.ThreadPoolExecutor$Worker.runTask(ThreadPoolExecutor.java:886)
at java.util.concurrent.ThreadPoolExecutor$Worker.run(ThreadPoolExecutor.java:908)
at java.lang.Thread.run(Thread.java:680)
at org.jclouds.concurrent.config.ExecutorServiceModule$DescribingExecutorService.submit(ExecutorServiceModule.java:182)
at org.jclouds.http.internal.BaseHttpCommandExecutorService.submit(BaseHttpCommandExecutorService.java:131)
at org.jclouds.http.TransformingHttpCommandExecutorServiceImpl.submit(TransformingHttpCommandExecutorServiceImpl.java:54)
at org.jclouds.http.TransformingHttpCommandImpl.execute(TransformingHttpCommandImpl.java:73)
at org.jclouds.rest.internal.AsyncRestClientProxy.createListenableFuture(AsyncRestClientProxy.java:156)
at org.jclouds.rest.internal.AsyncRestClientProxy.invoke(AsyncRestClientProxy.java:126)
at $Proxy65.createServer(Unknown Source)
at sun.reflect.NativeMethodAccessorImpl.invoke0(Native Method)
at sun.reflect.NativeMethodAccessorImpl.invoke(NativeMethodAccessorImpl.java:39)
at sun.reflect.DelegatingMethodAccessorImpl.invoke(DelegatingMethodAccessorImpl.java:25)
at java.lang.reflect.Method.invoke(Method.java:597)
at org.jclouds.concurrent.internal.SyncProxy.invoke(SyncProxy.java:137)
at $Proxy66.createServer(Unknown Source)
at org.jclouds.rimuhosting.miro.compute.strategy.RimuHostingCreateNodeWithGroupEncodedIntoName.createNodeWithGroupEncodedIntoName(RimuHostingCreateNodeWithGroupEncodedIntoName.java:58)
at org.jclouds.compute.strategy.impl.CreateNodesWithGroupEncodedIntoNameThenAddToSet$AddNode.call(CreateNodesWithGroupEncodedIntoNameThenAddToSet.java:80)
at org.jclouds.compute.strategy.impl.CreateNodesWithGroupEncodedIntoNameThenAddToSet$AddNode.call(CreateNodesWithGroupEncodedIntoNameThenAddToSet.java:63)
at java.util.concurrent.FutureTask$Sync.innerRun(FutureTask.java:303)
at java.util.concurrent.FutureTask.run(FutureTask.java:138)
at java.util.concurrent.ThreadPoolExecutor$Worker.runTask(ThreadPoolExecutor.java:886)
at java.util.concurrent.ThreadPoolExecutor$Worker.run(ThreadPoolExecutor.java:908)
at java.lang.Thread.run(Thread.java:680)
at org.jclouds.concurrent.config.ExecutorServiceModule$DescribingExecutorService.submit(ExecutorServiceModule.java:182)
at org.jclouds.compute.strategy.impl.CreateNodesWithGroupEncodedIntoNameThenAddToSet.execute(CreateNodesWithGroupEncodedIntoNameThenAddToSet.java:123)
at org.jclouds.compute.internal.BaseComputeService.createNodesInGroup(BaseComputeService.java:199)
at org.jclouds.compute.internal.BaseComputeService.createNodesInGroup(BaseComputeService.java:215)
at org.jclouds.compute.BaseComputeServiceLiveTest.testCreateAndRunAService(BaseComputeServiceLiveTest.java:649)
at sun.reflect.NativeMethodAccessorImpl.invoke0(Native Method)
at sun.reflect.NativeMethodAccessorImpl.invoke(NativeMethodAccessorImpl.java:39)
at sun.reflect.DelegatingMethodAccessorImpl.invoke(DelegatingMethodAccessorImpl.java:25)
at java.lang.reflect.Method.invoke(Method.java:597)
at org.testng.internal.MethodInvocationHelper.invokeMethod(MethodInvocationHelper.java:80)
at org.testng.internal.Invoker.invokeMethod(Invoker.java:691)
at org.testng.internal.Invoker.invokeTestMethod(Invoker.java:883)
at org.testng.internal.Invoker.invokeTestMethods(Invoker.java:1208)
at org.testng.internal.TestMethodWorker.invokeTestMethods(TestMethodWorker.java:127)
at org.testng.internal.TestMethodWorker.run(TestMethodWorker.java:111)
at org.testng.TestRunner.privateRun(TestRunner.java:758)
at org.testng.TestRunner.run(TestRunner.java:613)
at org.testng.SuiteRunner.runTest(SuiteRunner.java:334)
at org.testng.SuiteRunner.access$000(SuiteRunner.java:37)
at org.testng.SuiteRunner$SuiteWorker.run(SuiteRunner.java:368)
at org.testng.internal.thread.ThreadUtil$CountDownLatchedRunnable.run(ThreadUtil.java:165)
at java.util.concurrent.ThreadPoolExecutor$Worker.runTask(ThreadPoolExecutor.java:886)
at java.util.concurrent.ThreadPoolExecutor$Worker.run(ThreadPoolExecutor.java:908)
at java.lang.Thread.run(Thread.java:680)
at org.jclouds.concurrent.config.ExecutorServiceModule$DescribingExecutorService.submit(ExecutorServiceModule.java:182)
at org.jclouds.compute.strategy.impl.CreateNodesWithGroupEncodedIntoNameThenAddToSet.execute(CreateNodesWithGroupEncodedIntoNameThenAddToSet.java:123)
at org.jclouds.compute.internal.BaseComputeService.createNodesInGroup(BaseComputeService.java:199)
at org.jclouds.compute.internal.BaseComputeService.createNodesInGroup(BaseComputeService.java:215)
at org.jclouds.compute.BaseComputeServiceLiveTest.testCreateAndRunAService(BaseComputeServiceLiveTest.java:649)
at sun.reflect.NativeMethodAccessorImpl.invoke0(Native Method)
at sun.reflect.NativeMethodAccessorImpl.invoke(NativeMethodAccessorImpl.java:39)
at sun.reflect.DelegatingMethodAccessorImpl.invoke(DelegatingMethodAccessorImpl.java:25)
at java.lang.reflect.Method.invoke(Method.java:597)
at org.testng.internal.MethodInvocationHelper.invokeMethod(MethodInvocationHelper.java:80)
at org.testng.internal.Invoker.invokeMethod(Invoker.java:691)
at org.testng.internal.Invoker.invokeTestMethod(Invoker.java:883)
at org.testng.internal.Invoker.invokeTestMethods(Invoker.java:1208)
at org.testng.internal.TestMethodWorker.invokeTestMethods(TestMethodWorker.java:127)
at org.testng.internal.TestMethodWorker.run(TestMethodWorker.java:111)
at org.testng.TestRunner.privateRun(TestRunner.java:758)
at org.testng.TestRunner.run(TestRunner.java:613)
at org.testng.SuiteRunner.runTest(SuiteRunner.java:334)
at org.testng.SuiteRunner.access$000(SuiteRunner.java:37)
at org.testng.SuiteRunner$SuiteWorker.run(SuiteRunner.java:368)
at org.testng.internal.thread.ThreadUtil$CountDownLatchedRunnable.run(ThreadUtil.java:165)
at java.util.concurrent.ThreadPoolExecutor$Worker.runTask(ThreadPoolExecutor.java:886)
at java.util.concurrent.ThreadPoolExecutor$Worker.run(ThreadPoolExecutor.java:908)
at java.lang.Thread.run(Thread.java:680)
at org.jclouds.concurrent.config.ExecutorServiceModule$DescribingExecutorService.submit(ExecutorServiceModule.java:182)
at org.jclouds.http.internal.BaseHttpCommandExecutorService.submit(BaseHttpCommandExecutorService.java:131)
at org.jclouds.http.TransformingHttpCommandExecutorServiceImpl.submit(TransformingHttpCommandExecutorServiceImpl.java:54)
at org.jclouds.http.TransformingHttpCommandImpl.execute(TransformingHttpCommandImpl.java:73)
at org.jclouds.rest.internal.AsyncRestClientProxy.createListenableFuture(AsyncRestClientProxy.java:156)
at org.jclouds.rest.internal.AsyncRestClientProxy.invoke(AsyncRestClientProxy.java:126)
at $Proxy65.createServer(Unknown Source)
at sun.reflect.NativeMethodAccessorImpl.invoke0(Native Method)
at sun.reflect.NativeMethodAccessorImpl.invoke(NativeMethodAccessorImpl.java:39)
at sun.reflect.DelegatingMethodAccessorImpl.invoke(DelegatingMethodAccessorImpl.java:25)
at java.lang.reflect.Method.invoke(Method.java:597)
at org.jclouds.concurrent.internal.SyncProxy.invoke(SyncProxy.java:137)
at $Proxy66.createServer(Unknown Source)
at org.jclouds.rimuhosting.miro.compute.strategy.RimuHostingCreateNodeWithGroupEncodedIntoName.createNodeWithGroupEncodedIntoName(RimuHostingCreateNodeWithGroupEncodedIntoName.java:58)
at org.jclouds.compute.strategy.impl.CreateNodesWithGroupEncodedIntoNameThenAddToSet$AddNode.call(CreateNodesWithGroupEncodedIntoNameThenAddToSet.java:80)
at org.jclouds.compute.strategy.impl.CreateNodesWithGroupEncodedIntoNameThenAddToSet$AddNode.call(CreateNodesWithGroupEncodedIntoNameThenAddToSet.java:63)
at java.util.concurrent.FutureTask$Sync.innerRun(FutureTask.java:303)
at java.util.concurrent.FutureTask.run(FutureTask.java:138)
at java.util.concurrent.ThreadPoolExecutor$Worker.runTask(ThreadPoolExecutor.java:886)
at java.util.concurrent.ThreadPoolExecutor$Worker.run(ThreadPoolExecutor.java:908)
at java.lang.Thread.run(Thread.java:680)
at org.jclouds.concurrent.config.ExecutorServiceModule$DescribingExecutorService.submit(ExecutorServiceModule.java:182)
at org.jclouds.http.internal.BaseHttpCommandExecutorService.submit(BaseHttpCommandExecutorService.java:131)
at org.jclouds.http.TransformingHttpCommandExecutorServiceImpl.submit(TransformingHttpCommandExecutorServiceImpl.java:54)
at org.jclouds.http.TransformingHttpCommandImpl.execute(TransformingHttpCommandImpl.java:73)
at org.jclouds.rest.internal.AsyncRestClientProxy.createListenableFuture(AsyncRestClientProxy.java:156)
at org.jclouds.rest.internal.AsyncRestClientProxy.invoke(AsyncRestClientProxy.java:126)
at $Proxy65.createServer(Unknown Source)
at sun.reflect.NativeMethodAccessorImpl.invoke0(Native Method)
at sun.reflect.NativeMethodAccessorImpl.invoke(NativeMethodAccessorImpl.java:39)
at sun.reflect.DelegatingMethodAccessorImpl.invoke(DelegatingMethodAccessorImpl.java:25)
at java.lang.reflect.Method.invoke(Method.java:597)
at org.jclouds.concurrent.internal.SyncProxy.invoke(SyncProxy.java:137)
at $Proxy66.createServer(Unknown Source)
at org.jclouds.rimuhosting.miro.compute.strategy.RimuHostingCreateNodeWithGroupEncodedIntoName.createNodeWithGroupEncodedIntoName(RimuHostingCreateNodeWithGroupEncodedIntoName.java:58)
at org.jclouds.compute.strategy.impl.CreateNodesWithGroupEncodedIntoNameThenAddToSet$AddNode.call(CreateNodesWithGroupEncodedIntoNameThenAddToSet.java:80)
at org.jclouds.compute.strategy.impl.CreateNodesWithGroupEncodedIntoNameThenAddToSet$AddNode.call(CreateNodesWithGroupEncodedIntoNameThenAddToSet.java:63)
at java.util.concurrent.FutureTask$Sync.innerRun(FutureTask.java:303)
at java.util.concurrent.FutureTask.run(FutureTask.java:138)
... 3 more
1 error[s]
Node failures:
0 error[s]
at org.jclouds.compute.internal.BaseComputeService.createNodesInGroup(BaseComputeService.java:207)
at org.jclouds.compute.internal.BaseComputeService.createNodesInGroup(BaseComputeService.java:215)
at org.jclouds.compute.BaseComputeServiceLiveTest.testCreateAndRunAService(BaseComputeServiceLiveTest.java:649)
at sun.reflect.NativeMethodAccessorImpl.invoke0(Native Method)
at sun.reflect.NativeMethodAccessorImpl.invoke(NativeMethodAccessorImpl.java:39)
at sun.reflect.DelegatingMethodAccessorImpl.invoke(DelegatingMethodAccessorImpl.java:25)
at java.lang.reflect.Method.invoke(Method.java:597)
at org.testng.internal.MethodInvocationHelper.invokeMethod(MethodInvocationHelper.java:80)
at org.testng.internal.Invoker.invokeMethod(Invoker.java:691)
at org.testng.internal.Invoker.invokeTestMethod(Invoker.java:883)
at org.testng.internal.Invoker.invokeTestMethods(Invoker.java:1208)
at org.testng.internal.TestMethodWorker.invokeTestMethods(TestMethodWorker.java:127)
at org.testng.internal.TestMethodWorker.run(TestMethodWorker.java:111)
at org.testng.TestRunner.privateRun(TestRunner.java:758)
at org.testng.TestRunner.run(TestRunner.java:613)
at org.testng.SuiteRunner.runTest(SuiteRunner.java:334)
at org.testng.SuiteRunner.access$000(SuiteRunner.java:37)
at org.testng.SuiteRunner$SuiteWorker.run(SuiteRunner.java:368)
at org.testng.internal.thread.ThreadUtil$CountDownLatchedRunnable.run(ThreadUtil.java:165)
at java.util.concurrent.ThreadPoolExecutor$Worker.runTask(ThreadPoolExecutor.java:886)
at java.util.concurrent.ThreadPoolExecutor$Worker.run(ThreadPoolExecutor.java:908)
at java.lang.Thread.run(Thread.java:680)
Caused by: org.jclouds.http.HttpResponseException: command: POST https://api.rimuhosting.com/r/orders/new-vps HTTP/1.1 failed with response: HTTP/1.1 406 Not Acceptable; content: [{ "post_new_vps_response" : { "status_message" : "Not Acceptable"
, "status_code" : 406
, "response_created_time" : { "ms_since_epoch": 1326650755041, "iso_format" : "2012-01-15T18:05:55Z", "users_tz_offset_ms" : 46800000}
, "response_created_time_epoch_ms" : 1326650755041
, "error_info" : { "error_class" : "ValidationError"
, "full_error_message" : "memory_mb: The 64 bit distros require a good amount of memory. Try 256MB or more."
, "human_readable_message" : "The 64 bit distros require a good amount of memory. Try 256MB or more."
, "error_title" : "Validation Problem"
, "field_name" : "memory_mb"}
, "extended_error_infos" : [{ "error_class" : "ValidationError"
, "full_error_message" : "memory_mb: The 64 bit distros require a good amount of memory. Try 256MB or more."
, "human_readable_message" : "The 64 bit distros require a good amount of memory. Try 256MB or more."
, "error_title" : "Validation Problem"
, "field_name" : "memory_mb"}]
, "response_type" : "ERROR"
, "human_readable_message" : "The 64 bit distros require a good amount of memory. Try 256MB or more."
, "redirect_uri" : null
, "response_display_duration_type" : "REGULAR"
, "setup_messages" : ["Selected user as the logged in user: Ivan Meredith"
, "Selected billing details as the first 'wire' billing details found for the user: Wire Transfer"
, "No VPS paramters provided, using default values."
, "'memory_mb' not provided, setting to 160MB."
, "'disk_space_mb' not provided, setting to 4GB."
, "memory_mb: The 64 bit distros require a good amount of memory. Try 256MB or more."]
, "about_order" : null
, "new_order_request" : { "billing_oid" : 0
, "user_oid" : 0
, "host_server_oid" : null
, "ip_request" : null
, "vps_parameters" : null
, "pricing_plan_code" : "MIRO4B"
, "dc_location" : null
, "vps_type" : null
, "instantiation_options" : { "domain_name" : "rimuhosting.jcloudss-e14"
, "control_panel" : "none"
, "password" : "fuyekeza22"
, "distro" : "ubuntu1110.64"}
, "instantiation_via_clone_options" : null
, "file_injection_data" : null
, "meta_data" : []}
, "running_vps_info" : null}}
]
at org.jclouds.http.handlers.CloseContentAndSetExceptionErrorHandler.handleError(CloseContentAndSetExceptionErrorHandler.java:44)
at org.jclouds.http.handlers.DelegatingErrorHandler.handleError(DelegatingErrorHandler.java:69)
at org.jclouds.http.internal.BaseHttpCommandExecutorService$HttpResponseCallable.shouldContinue(BaseHttpCommandExecutorService.java:200)
at org.jclouds.http.internal.BaseHttpCommandExecutorService$HttpResponseCallable.call(BaseHttpCommandExecutorService.java:165)
at org.jclouds.http.internal.BaseHttpCommandExecutorService$HttpResponseCallable.call(BaseHttpCommandExecutorService.java:134)
at java.util.concurrent.FutureTask$Sync.innerRun(FutureTask.java:303)
at java.util.concurrent.FutureTask.run(FutureTask.java:138)
at java.util.concurrent.ThreadPoolExecutor$Worker.runTask(ThreadPoolExecutor.java:886)
at java.util.concurrent.ThreadPoolExecutor$Worker.run(ThreadPoolExecutor.java:908)
at java.lang.Thread.run(Thread.java:680)
at org.jclouds.concurrent.config.ExecutorServiceModule$DescribingExecutorService.submit(ExecutorServiceModule.java:182)
at org.jclouds.http.internal.BaseHttpCommandExecutorService.submit(BaseHttpCommandExecutorService.java:131)
at org.jclouds.http.TransformingHttpCommandExecutorServiceImpl.submit(TransformingHttpCommandExecutorServiceImpl.java:54)
at org.jclouds.http.TransformingHttpCommandImpl.execute(TransformingHttpCommandImpl.java:73)
at org.jclouds.rest.internal.AsyncRestClientProxy.createListenableFuture(AsyncRestClientProxy.java:156)
at org.jclouds.rest.internal.AsyncRestClientProxy.invoke(AsyncRestClientProxy.java:126)
at $Proxy65.createServer(Unknown Source)
at sun.reflect.NativeMethodAccessorImpl.invoke0(Native Method)
at sun.reflect.NativeMethodAccessorImpl.invoke(NativeMethodAccessorImpl.java:39)
at sun.reflect.DelegatingMethodAccessorImpl.invoke(DelegatingMethodAccessorImpl.java:25)
at java.lang.reflect.Method.invoke(Method.java:597)
at org.jclouds.concurrent.internal.SyncProxy.invoke(SyncProxy.java:137)
at $Proxy66.createServer(Unknown Source)
at org.jclouds.rimuhosting.miro.compute.strategy.RimuHostingCreateNodeWithGroupEncodedIntoName.createNodeWithGroupEncodedIntoName(RimuHostingCreateNodeWithGroupEncodedIntoName.java:58)
at org.jclouds.compute.strategy.impl.CreateNodesWithGroupEncodedIntoNameThenAddToSet$AddNode.call(CreateNodesWithGroupEncodedIntoNameThenAddToSet.java:80)
at org.jclouds.compute.strategy.impl.CreateNodesWithGroupEncodedIntoNameThenAddToSet$AddNode.call(CreateNodesWithGroupEncodedIntoNameThenAddToSet.java:63)
at java.util.concurrent.FutureTask$Sync.innerRun(FutureTask.java:303)
at java.util.concurrent.FutureTask.run(FutureTask.java:138)
at java.util.concurrent.ThreadPoolExecutor$Worker.runTask(ThreadPoolExecutor.java:886)
at java.util.concurrent.ThreadPoolExecutor$Worker.run(ThreadPoolExecutor.java:908)
at java.lang.Thread.run(Thread.java:680)
at org.jclouds.concurrent.config.ExecutorServiceModule$DescribingExecutorService.submit(ExecutorServiceModule.java:182)
at org.jclouds.compute.strategy.impl.CreateNodesWithGroupEncodedIntoNameThenAddToSet.execute(CreateNodesWithGroupEncodedIntoNameThenAddToSet.java:123)
at org.jclouds.compute.internal.BaseComputeService.createNodesInGroup(BaseComputeService.java:199)
at org.jclouds.compute.internal.BaseComputeService.createNodesInGroup(BaseComputeService.java:215)
at org.jclouds.compute.BaseComputeServiceLiveTest.testCreateAndRunAService(BaseComputeServiceLiveTest.java:649)
at sun.reflect.NativeMethodAccessorImpl.invoke0(Native Method)
at sun.reflect.NativeMethodAccessorImpl.invoke(NativeMethodAccessorImpl.java:39)
at sun.reflect.DelegatingMethodAccessorImpl.invoke(DelegatingMethodAccessorImpl.java:25)
at java.lang.reflect.Method.invoke(Method.java:597)
at org.testng.internal.MethodInvocationHelper.invokeMethod(MethodInvocationHelper.java:80)
at org.testng.internal.Invoker.invokeMethod(Invoker.java:691)
at org.testng.internal.Invoker.invokeTestMethod(Invoker.java:883)
at org.testng.internal.Invoker.invokeTestMethods(Invoker.java:1208)
at org.testng.internal.TestMethodWorker.invokeTestMethods(TestMethodWorker.java:127)
at org.testng.internal.TestMethodWorker.run(TestMethodWorker.java:111)
at org.testng.TestRunner.privateRun(TestRunner.java:758)
at org.testng.TestRunner.run(TestRunner.java:613)
at org.testng.SuiteRunner.runTest(SuiteRunner.java:334)
at org.testng.SuiteRunner.access$000(SuiteRunner.java:37)
at org.testng.SuiteRunner$SuiteWorker.run(SuiteRunner.java:368)
at org.testng.internal.thread.ThreadUtil$CountDownLatchedRunnable.run(ThreadUtil.java:165)
at java.util.concurrent.ThreadPoolExecutor$Worker.runTask(ThreadPoolExecutor.java:886)
at java.util.concurrent.ThreadPoolExecutor$Worker.run(ThreadPoolExecutor.java:908)
at java.lang.Thread.run(Thread.java:680)
at org.jclouds.concurrent.config.ExecutorServiceModule$DescribingExecutorService.submit(ExecutorServiceModule.java:182)
at org.jclouds.compute.strategy.impl.CreateNodesWithGroupEncodedIntoNameThenAddToSet.execute(CreateNodesWithGroupEncodedIntoNameThenAddToSet.java:123)
at org.jclouds.compute.internal.BaseComputeService.createNodesInGroup(BaseComputeService.java:199)
at org.jclouds.compute.internal.BaseComputeService.createNodesInGroup(BaseComputeService.java:215)
at org.jclouds.compute.BaseComputeServiceLiveTest.testCreateAndRunAService(BaseComputeServiceLiveTest.java:649)
at sun.reflect.NativeMethodAccessorImpl.invoke0(Native Method)
at sun.reflect.NativeMethodAccessorImpl.invoke(NativeMethodAccessorImpl.java:39)
at sun.reflect.DelegatingMethodAccessorImpl.invoke(DelegatingMethodAccessorImpl.java:25)
at java.lang.reflect.Method.invoke(Method.java:597)
at org.testng.internal.MethodInvocationHelper.invokeMethod(MethodInvocationHelper.java:80)
at org.testng.internal.Invoker.invokeMethod(Invoker.java:691)
at org.testng.internal.Invoker.invokeTestMethod(Invoker.java:883)
at org.testng.internal.Invoker.invokeTestMethods(Invoker.java:1208)
at org.testng.internal.TestMethodWorker.invokeTestMethods(TestMethodWorker.java:127)
at org.testng.internal.TestMethodWorker.run(TestMethodWorker.java:111)
at org.testng.TestRunner.privateRun(TestRunner.java:758)
at org.testng.TestRunner.run(TestRunner.java:613)
at org.testng.SuiteRunner.runTest(SuiteRunner.java:334)
at org.testng.SuiteRunner.access$000(SuiteRunner.java:37)
at org.testng.SuiteRunner$SuiteWorker.run(SuiteRunner.java:368)
at org.testng.internal.thread.ThreadUtil$CountDownLatchedRunnable.run(ThreadUtil.java:165)
at java.util.concurrent.ThreadPoolExecutor$Worker.runTask(ThreadPoolExecutor.java:886)
at java.util.concurrent.ThreadPoolExecutor$Worker.run(ThreadPoolExecutor.java:908)
at java.lang.Thread.run(Thread.java:680)
at org.jclouds.concurrent.config.ExecutorServiceModule$DescribingExecutorService.submit(ExecutorServiceModule.java:182)
at org.jclouds.http.internal.BaseHttpCommandExecutorService.submit(BaseHttpCommandExecutorService.java:131)
at org.jclouds.http.TransformingHttpCommandExecutorServiceImpl.submit(TransformingHttpCommandExecutorServiceImpl.java:54)
at org.jclouds.http.TransformingHttpCommandImpl.execute(TransformingHttpCommandImpl.java:73)
at org.jclouds.rest.internal.AsyncRestClientProxy.createListenableFuture(AsyncRestClientProxy.java:156)
at org.jclouds.rest.internal.AsyncRestClientProxy.invoke(AsyncRestClientProxy.java:126)
at $Proxy65.createServer(Unknown Source)
at sun.reflect.NativeMethodAccessorImpl.invoke0(Native Method)
at sun.reflect.NativeMethodAccessorImpl.invoke(NativeMethodAccessorImpl.java:39)
at sun.reflect.DelegatingMethodAccessorImpl.invoke(DelegatingMethodAccessorImpl.java:25)
at java.lang.reflect.Method.invoke(Method.java:597)
at org.jclouds.concurrent.internal.SyncProxy.invoke(SyncProxy.java:137)
at $Proxy66.createServer(Unknown Source)
at org.jclouds.rimuhosting.miro.compute.strategy.RimuHostingCreateNodeWithGroupEncodedIntoName.createNodeWithGroupEncodedIntoName(RimuHostingCreateNodeWithGroupEncodedIntoName.java:58)
at org.jclouds.compute.strategy.impl.CreateNodesWithGroupEncodedIntoNameThenAddToSet$AddNode.call(CreateNodesWithGroupEncodedIntoNameThenAddToSet.java:80)
at org.jclouds.compute.strategy.impl.CreateNodesWithGroupEncodedIntoNameThenAddToSet$AddNode.call(CreateNodesWithGroupEncodedIntoNameThenAddToSet.java:63)
at java.util.concurrent.FutureTask$Sync.innerRun(FutureTask.java:303)
at java.util.concurrent.FutureTask.run(FutureTask.java:138)
at java.util.concurrent.ThreadPoolExecutor$Worker.runTask(ThreadPoolExecutor.java:886)
at java.util.concurrent.ThreadPoolExecutor$Worker.run(ThreadPoolExecutor.java:908)
at java.lang.Thread.run(Thread.java:680)
at org.jclouds.concurrent.config.ExecutorServiceModule$DescribingExecutorService.submit(ExecutorServiceModule.java:182)
at org.jclouds.http.internal.BaseHttpCommandExecutorService.submit(BaseHttpCommandExecutorService.java:131)
at org.jclouds.http.TransformingHttpCommandExecutorServiceImpl.submit(TransformingHttpCommandExecutorServiceImpl.java:54)
at org.jclouds.http.TransformingHttpCommandImpl.execute(TransformingHttpCommandImpl.java:73)
at org.jclouds.rest.internal.AsyncRestClientProxy.createListenableFuture(AsyncRestClientProxy.java:156)
at org.jclouds.rest.internal.AsyncRestClientProxy.invoke(AsyncRestClientProxy.java:126)
at $Proxy65.createServer(Unknown Source)
at sun.reflect.NativeMethodAccessorImpl.invoke0(Native Method)
at sun.reflect.NativeMethodAccessorImpl.invoke(NativeMethodAccessorImpl.java:39)
at sun.reflect.DelegatingMethodAccessorImpl.invoke(DelegatingMethodAccessorImpl.java:25)
at java.lang.reflect.Method.invoke(Method.java:597)
at org.jclouds.concurrent.internal.SyncProxy.invoke(SyncProxy.java:137)
at $Proxy66.createServer(Unknown Source)
at org.jclouds.rimuhosting.miro.compute.strategy.RimuHostingCreateNodeWithGroupEncodedIntoName.createNodeWithGroupEncodedIntoName(RimuHostingCreateNodeWithGroupEncodedIntoName.java:58)
at org.jclouds.compute.strategy.impl.CreateNodesWithGroupEncodedIntoNameThenAddToSet$AddNode.call(CreateNodesWithGroupEncodedIntoNameThenAddToSet.java:80)
at org.jclouds.compute.strategy.impl.CreateNodesWithGroupEncodedIntoNameThenAddToSet$AddNode.call(CreateNodesWithGroupEncodedIntoNameThenAddToSet.java:63)
at java.util.concurrent.FutureTask$Sync.innerRun(FutureTask.java:303)
at java.util.concurrent.FutureTask.run(FutureTask.java:138)
... 3 more
1 error[s]
Node failures:
0 error[s]
at org.jclouds.compute.internal.BaseComputeService.createNodesInGroup(BaseComputeService.java:207)
at org.jclouds.compute.internal.BaseComputeService.createNodesInGroup(BaseComputeService.java:215)
at org.jclouds.compute.BaseComputeServiceLiveTest.testCreateAndRunAService(BaseComputeServiceLiveTest.java:649)
at sun.reflect.NativeMethodAccessorImpl.invoke0(Native Method)
at sun.reflect.NativeMethodAccessorImpl.invoke(NativeMethodAccessorImpl.java:39)
at sun.reflect.DelegatingMethodAccessorImpl.invoke(DelegatingMethodAccessorImpl.java:25)
at java.lang.reflect.Method.invoke(Method.java:597)
at org.testng.internal.MethodInvocationHelper.invokeMethod(MethodInvocationHelper.java:80)
at org.testng.internal.Invoker.invokeMethod(Invoker.java:691)
at org.testng.internal.Invoker.invokeTestMethod(Invoker.java:883)
at org.testng.internal.Invoker.invokeTestMethods(Invoker.java:1208)
at org.testng.internal.TestMethodWorker.invokeTestMethods(TestMethodWorker.java:127)
at org.testng.internal.TestMethodWorker.run(TestMethodWorker.java:111)
at org.testng.TestRunner.privateRun(TestRunner.java:758)
at org.testng.TestRunner.run(TestRunner.java:613)
at org.testng.SuiteRunner.runTest(SuiteRunner.java:334)
at org.testng.SuiteRunner.access$000(SuiteRunner.java:37)
at org.testng.SuiteRunner$SuiteWorker.run(SuiteRunner.java:368)
at org.testng.internal.thread.ThreadUtil$CountDownLatchedRunnable.run(ThreadUtil.java:165)
at java.util.concurrent.ThreadPoolExecutor$Worker.runTask(ThreadPoolExecutor.java:886)
at java.util.concurrent.ThreadPoolExecutor$Worker.run(ThreadPoolExecutor.java:908)
at java.lang.Thread.run(Thread.java:680)
testTemplateBuilderCanFind(org.jclouds.rimuhosting.miro.compute.RimuHostingTemplateBuilderLiveTest) Time elapsed: 0.017 sec <<< FAILURE!
java.util.NoSuchElementException: no image matched predicate: And(locationEqualsOrChildOf(DCDALLAS),And(osFamily(ubuntu),osVersion(^10.10$),os64Bit(true)))
at org.jclouds.compute.domain.internal.TemplateBuilderImpl.throwNoSuchElementExceptionAfterLoggingImageIds(TemplateBuilderImpl.java:619)
at org.jclouds.compute.domain.internal.TemplateBuilderImpl.build(TemplateBuilderImpl.java:607)
at org.jclouds.compute.BaseTemplateBuilderLiveTest.testTemplateBuilderCanFind(BaseTemplateBuilderLiveTest.java:149)
at sun.reflect.NativeMethodAccessorImpl.invoke0(Native Method)
at sun.reflect.NativeMethodAccessorImpl.invoke(NativeMethodAccessorImpl.java:39)
at sun.reflect.DelegatingMethodAccessorImpl.invoke(DelegatingMethodAccessorImpl.java:25)
at java.lang.reflect.Method.invoke(Method.java:597)
at org.testng.internal.MethodInvocationHelper.invokeMethod(MethodInvocationHelper.java:80)
at org.testng.internal.Invoker.invokeMethod(Invoker.java:691)
at org.testng.internal.Invoker.invokeTestMethod(Invoker.java:883)
at org.testng.internal.Invoker.invokeTestMethods(Invoker.java:1208)
at org.testng.internal.TestMethodWorker.invokeTestMethods(TestMethodWorker.java:127)
at org.testng.internal.TestMethodWorker.run(TestMethodWorker.java:111)
at org.testng.TestRunner.privateRun(TestRunner.java:758)
at org.testng.TestRunner.run(TestRunner.java:613)
at org.testng.SuiteRunner.runTest(SuiteRunner.java:334)
at org.testng.SuiteRunner.access$000(SuiteRunner.java:37)
at org.testng.SuiteRunner$SuiteWorker.run(SuiteRunner.java:368)
at org.testng.internal.thread.ThreadUtil$CountDownLatchedRunnable.run(ThreadUtil.java:165)
at java.util.concurrent.ThreadPoolExecutor$Worker.runTask(ThreadPoolExecutor.java:886)
at java.util.concurrent.ThreadPoolExecutor$Worker.run(ThreadPoolExecutor.java:908)
at java.lang.Thread.run(Thread.java:680)
testTemplateBuilderCanFind(org.jclouds.rimuhosting.miro.compute.RimuHostingTemplateBuilderLiveTest) Time elapsed: 0 sec <<< FAILURE!
java.util.NoSuchElementException: no image matched predicate: And(locationEqualsOrChildOf(DCDALLAS),And(osFamily(ubuntu),osVersion(^10.10$),os64Bit(false)))
at org.jclouds.compute.domain.internal.TemplateBuilderImpl.throwNoSuchElementExceptionAfterLoggingImageIds(TemplateBuilderImpl.java:619)
at org.jclouds.compute.domain.internal.TemplateBuilderImpl.build(TemplateBuilderImpl.java:607)
at org.jclouds.compute.BaseTemplateBuilderLiveTest.testTemplateBuilderCanFind(BaseTemplateBuilderLiveTest.java:149)
at sun.reflect.NativeMethodAccessorImpl.invoke0(Native Method)
at sun.reflect.NativeMethodAccessorImpl.invoke(NativeMethodAccessorImpl.java:39)
at sun.reflect.DelegatingMethodAccessorImpl.invoke(DelegatingMethodAccessorImpl.java:25)
at java.lang.reflect.Method.invoke(Method.java:597)
at org.testng.internal.MethodInvocationHelper.invokeMethod(MethodInvocationHelper.java:80)
at org.testng.internal.Invoker.invokeMethod(Invoker.java:691)
at org.testng.internal.Invoker.invokeTestMethod(Invoker.java:883)
at org.testng.internal.Invoker.invokeTestMethods(Invoker.java:1208)
at org.testng.internal.TestMethodWorker.invokeTestMethods(TestMethodWorker.java:127)
at org.testng.internal.TestMethodWorker.run(TestMethodWorker.java:111)
at org.testng.TestRunner.privateRun(TestRunner.java:758)
at org.testng.TestRunner.run(TestRunner.java:613)
at org.testng.SuiteRunner.runTest(SuiteRunner.java:334)
at org.testng.SuiteRunner.access$000(SuiteRunner.java:37)
at org.testng.SuiteRunner$SuiteWorker.run(SuiteRunner.java:368)
at org.testng.internal.thread.ThreadUtil$CountDownLatchedRunnable.run(ThreadUtil.java:165)
at java.util.concurrent.ThreadPoolExecutor$Worker.runTask(ThreadPoolExecutor.java:886)
at java.util.concurrent.ThreadPoolExecutor$Worker.run(ThreadPoolExecutor.java:908)
at java.lang.Thread.run(Thread.java:680)
testTemplateBuilderCannotFind(org.jclouds.rimuhosting.miro.compute.RimuHostingTemplateBuilderLiveTest) Time elapsed: 0.001 sec <<< FAILURE!
org.testng.TestException:
Method BaseTemplateBuilderLiveTest.testTemplateBuilderCannotFind(org.jclouds.compute.domain.OsFamilyVersion64Bit)[pri:0, instance:org.jclouds.rimuhosting.miro.compute.RimuHostingTemplateBuilderLiveTest@47171b26] should have thrown an exception of class java.util.NoSuchElementException
at org.testng.internal.Invoker.handleInvocationResults(Invoker.java:1485)
at org.testng.internal.Invoker.invokeMethod(Invoker.java:740)
at org.testng.internal.Invoker.invokeTestMethod(Invoker.java:883)
at org.testng.internal.Invoker.invokeTestMethods(Invoker.java:1208)
at org.testng.internal.TestMethodWorker.invokeTestMethods(TestMethodWorker.java:127)
at org.testng.internal.TestMethodWorker.run(TestMethodWorker.java:111)
at org.testng.TestRunner.privateRun(TestRunner.java:758)
at org.testng.TestRunner.run(TestRunner.java:613)
at org.testng.SuiteRunner.runTest(SuiteRunner.java:334)
at org.testng.SuiteRunner.access$000(SuiteRunner.java:37)
at org.testng.SuiteRunner$SuiteWorker.run(SuiteRunner.java:368)
at org.testng.internal.thread.ThreadUtil$CountDownLatchedRunnable.run(ThreadUtil.java:165)
at java.util.concurrent.ThreadPoolExecutor$Worker.runTask(ThreadPoolExecutor.java:886)
at java.util.concurrent.ThreadPoolExecutor$Worker.run(ThreadPoolExecutor.java:908)
at java.lang.Thread.run(Thread.java:680)
testTemplateBuilderCannotFind(org.jclouds.rimuhosting.miro.compute.RimuHostingTemplateBuilderLiveTest) Time elapsed: 0 sec <<< FAILURE!
org.testng.TestException:
Method BaseTemplateBuilderLiveTest.testTemplateBuilderCannotFind(org.jclouds.compute.domain.OsFamilyVersion64Bit)[pri:0, instance:org.jclouds.rimuhosting.miro.compute.RimuHostingTemplateBuilderLiveTest@47171b26] should have thrown an exception of class java.util.NoSuchElementException
at org.testng.internal.Invoker.handleInvocationResults(Invoker.java:1485)
at org.testng.internal.Invoker.invokeMethod(Invoker.java:740)
at org.testng.internal.Invoker.invokeTestMethod(Invoker.java:883)
at org.testng.internal.Invoker.invokeTestMethods(Invoker.java:1208)
at org.testng.internal.TestMethodWorker.invokeTestMethods(TestMethodWorker.java:127)
at org.testng.internal.TestMethodWorker.run(TestMethodWorker.java:111)
at org.testng.TestRunner.privateRun(TestRunner.java:758)
at org.testng.TestRunner.run(TestRunner.java:613)
at org.testng.SuiteRunner.runTest(SuiteRunner.java:334)
at org.testng.SuiteRunner.access$000(SuiteRunner.java:37)
at org.testng.SuiteRunner$SuiteWorker.run(SuiteRunner.java:368)
at org.testng.internal.thread.ThreadUtil$CountDownLatchedRunnable.run(ThreadUtil.java:165)
at java.util.concurrent.ThreadPoolExecutor$Worker.runTask(ThreadPoolExecutor.java:886)
at java.util.concurrent.ThreadPoolExecutor$Worker.run(ThreadPoolExecutor.java:908)
at java.lang.Thread.run(Thread.java:680)
testTemplateBuilderWithLoginUserSpecified(org.jclouds.rimuhosting.miro.compute.RimuHostingTemplateBuilderLiveTest) Time elapsed: 2.007 sec <<< FAILURE!
java.lang.AssertionError: expected:<[user=foo, passwordPresent=true, privateKeyPresent=false, shouldAuthenticateSudo=true]> but was:<null>
at org.testng.Assert.fail(Assert.java:89)
at org.testng.Assert.failNotEquals(Assert.java:489)
at org.testng.Assert.assertEquals(Assert.java:118)
at org.testng.Assert.assertEquals(Assert.java:160)
at org.jclouds.compute.BaseTemplateBuilderLiveTest.tryOverrideUsingPropertyKey(BaseTemplateBuilderLiveTest.java:281)
at org.jclouds.compute.BaseTemplateBuilderLiveTest.testTemplateBuilderWithLoginUserSpecified(BaseTemplateBuilderLiveTest.java:262)
at sun.reflect.NativeMethodAccessorImpl.invoke0(Native Method)
at sun.reflect.NativeMethodAccessorImpl.invoke(NativeMethodAccessorImpl.java:39)
at sun.reflect.DelegatingMethodAccessorImpl.invoke(DelegatingMethodAccessorImpl.java:25)
at java.lang.reflect.Method.invoke(Method.java:597)
at org.testng.internal.MethodInvocationHelper.invokeMethod(MethodInvocationHelper.java:80)
at org.testng.internal.Invoker.invokeMethod(Invoker.java:691)
at org.testng.internal.Invoker.invokeTestMethod(Invoker.java:883)
at org.testng.internal.Invoker.invokeTestMethods(Invoker.java:1208)
at org.testng.internal.TestMethodWorker.invokeTestMethods(TestMethodWorker.java:127)
at org.testng.internal.TestMethodWorker.run(TestMethodWorker.java:111)
at org.testng.TestRunner.privateRun(TestRunner.java:758)
at org.testng.TestRunner.run(TestRunner.java:613)
at org.testng.SuiteRunner.runTest(SuiteRunner.java:334)
at org.testng.SuiteRunner.access$000(SuiteRunner.java:37)
at org.testng.SuiteRunner$SuiteWorker.run(SuiteRunner.java:368)
at org.testng.internal.thread.ThreadUtil$CountDownLatchedRunnable.run(ThreadUtil.java:165)
at java.util.concurrent.ThreadPoolExecutor$Worker.runTask(ThreadPoolExecutor.java:886)
at java.util.concurrent.ThreadPoolExecutor$Worker.run(ThreadPoolExecutor.java:908)
at java.lang.Thread.run(Thread.java:680)
testTemplateBuilder(org.jclouds.rimuhosting.miro.compute.RimuHostingTemplateBuilderLiveTest) Time elapsed: 0 sec <<< FAILURE!
java.lang.AssertionError: expected:<11.04> but was:<11.10>
at org.testng.Assert.fail(Assert.java:89)
at org.testng.Assert.failNotEquals(Assert.java:489)
at org.testng.Assert.assertEquals(Assert.java:118)
at org.testng.Assert.assertEquals(Assert.java:171)
at org.testng.Assert.assertEquals(Assert.java:181)
at org.jclouds.rimuhosting.miro.compute.RimuHostingTemplateBuilderLiveTest.testTemplateBuilder(RimuHostingTemplateBuilderLiveTest.java:72)
testAScriptExecutionAfterBootWithBasicTemplate(org.jclouds.rimuhosting.miro.compute.RimuHostingComputeServiceLiveTest) Time elapsed: 4.819 sec <<< FAILURE!
org.jclouds.compute.RunNodesException: error running 1 node group(rimuhosting.jcloudsr) location(DCDALLAS) image(ubuntu1110.64) size(MIRO4B) options([inboundPorts=[22], privateKey=false, publicKey=false, runScript=false, blockUntilRunning=true, blockOnComplete=true, port:seconds=22:120, userMetadata: {}])
Execution failures:
1) ExecutionException on rimuhosting.jcloudsr-291:
java.util.concurrent.ExecutionException: org.jclouds.http.HttpResponseException: command: POST https://api.rimuhosting.com/r/orders/new-vps HTTP/1.1 failed with response: HTTP/1.1 406 Not Acceptable; content: [{ "post_new_vps_response" : { "status_message" : "Not Acceptable"
, "status_code" : 406
, "response_created_time" : { "ms_since_epoch": 1326650768829, "iso_format" : "2012-01-15T18:06:08Z", "users_tz_offset_ms" : 46800000}
, "response_created_time_epoch_ms" : 1326650768829
, "error_info" : { "error_class" : "ValidationError"
, "full_error_message" : "memory_mb: The 64 bit distros require a good amount of memory. Try 256MB or more."
, "human_readable_message" : "The 64 bit distros require a good amount of memory. Try 256MB or more."
, "error_title" : "Validation Problem"
, "field_name" : "memory_mb"}
, "extended_error_infos" : [{ "error_class" : "ValidationError"
, "full_error_message" : "memory_mb: The 64 bit distros require a good amount of memory. Try 256MB or more."
, "human_readable_message" : "The 64 bit distros require a good amount of memory. Try 256MB or more."
, "error_title" : "Validation Problem"
, "field_name" : "memory_mb"}]
, "response_type" : "ERROR"
, "human_readable_message" : "The 64 bit distros require a good amount of memory. Try 256MB or more."
, "redirect_uri" : null
, "response_display_duration_type" : "REGULAR"
, "setup_messages" : ["Selected user as the logged in user: Ivan Meredith"
, "Selected billing details as the first 'wire' billing details found for the user: Wire Transfer"
, "No VPS paramters provided, using default values."
, "'memory_mb' not provided, setting to 160MB."
, "'disk_space_mb' not provided, setting to 4GB."
, "memory_mb: The 64 bit distros require a good amount of memory. Try 256MB or more."]
, "about_order" : null
, "new_order_request" : { "billing_oid" : 0
, "user_oid" : 0
, "host_server_oid" : null
, "ip_request" : null
, "vps_parameters" : null
, "pricing_plan_code" : "MIRO4B"
, "dc_location" : null
, "vps_type" : null
, "instantiation_options" : { "domain_name" : "rimuhosting.jcloudsr-291"
, "control_panel" : "none"
, "password" : "rezeru87"
, "distro" : "ubuntu1110.64"}
, "instantiation_via_clone_options" : null
, "file_injection_data" : null
, "meta_data" : []}
, "running_vps_info" : null}}
]
at com.google.common.util.concurrent.AbstractFuture$Sync.getValue(AbstractFuture.java:289)
at com.google.common.util.concurrent.AbstractFuture$Sync.get(AbstractFuture.java:276)
at com.google.common.util.concurrent.AbstractFuture.get(AbstractFuture.java:111)
at com.google.common.util.concurrent.Futures$ChainingListenableFuture.get(Futures.java:635)
at org.jclouds.concurrent.FutureIterables$1.run(FutureIterables.java:126)
at java.util.concurrent.ThreadPoolExecutor$Worker.runTask(ThreadPoolExecutor.java:886)
at java.util.concurrent.ThreadPoolExecutor$Worker.run(ThreadPoolExecutor.java:908)
at java.lang.Thread.run(Thread.java:680)
Caused by: org.jclouds.http.HttpResponseException: command: POST https://api.rimuhosting.com/r/orders/new-vps HTTP/1.1 failed with response: HTTP/1.1 406 Not Acceptable; content: [{ "post_new_vps_response" : { "status_message" : "Not Acceptable"
, "status_code" : 406
, "response_created_time" : { "ms_since_epoch": 1326650768829, "iso_format" : "2012-01-15T18:06:08Z", "users_tz_offset_ms" : 46800000}
, "response_created_time_epoch_ms" : 1326650768829
, "error_info" : { "error_class" : "ValidationError"
, "full_error_message" : "memory_mb: The 64 bit distros require a good amount of memory. Try 256MB or more."
, "human_readable_message" : "The 64 bit distros require a good amount of memory. Try 256MB or more."
, "error_title" : "Validation Problem"
, "field_name" : "memory_mb"}
, "extended_error_infos" : [{ "error_class" : "ValidationError"
, "full_error_message" : "memory_mb: The 64 bit distros require a good amount of memory. Try 256MB or more."
, "human_readable_message" : "The 64 bit distros require a good amount of memory. Try 256MB or more."
, "error_title" : "Validation Problem"
, "field_name" : "memory_mb"}]
, "response_type" : "ERROR"
, "human_readable_message" : "The 64 bit distros require a good amount of memory. Try 256MB or more."
, "redirect_uri" : null
, "response_display_duration_type" : "REGULAR"
, "setup_messages" : ["Selected user as the logged in user: Ivan Meredith"
, "Selected billing details as the first 'wire' billing details found for the user: Wire Transfer"
, "No VPS paramters provided, using default values."
, "'memory_mb' not provided, setting to 160MB."
, "'disk_space_mb' not provided, setting to 4GB."
, "memory_mb: The 64 bit distros require a good amount of memory. Try 256MB or more."]
, "about_order" : null
, "new_order_request" : { "billing_oid" : 0
, "user_oid" : 0
, "host_server_oid" : null
, "ip_request" : null
, "vps_parameters" : null
, "pricing_plan_code" : "MIRO4B"
, "dc_location" : null
, "vps_type" : null
, "instantiation_options" : { "domain_name" : "rimuhosting.jcloudsr-291"
, "control_panel" : "none"
, "password" : "rezeru87"
, "distro" : "ubuntu1110.64"}
, "instantiation_via_clone_options" : null
, "file_injection_data" : null
, "meta_data" : []}
, "running_vps_info" : null}}
]
at org.jclouds.http.handlers.CloseContentAndSetExceptionErrorHandler.handleError(CloseContentAndSetExceptionErrorHandler.java:44)
at org.jclouds.http.handlers.DelegatingErrorHandler.handleError(DelegatingErrorHandler.java:69)
at org.jclouds.http.internal.BaseHttpCommandExecutorService$HttpResponseCallable.shouldContinue(BaseHttpCommandExecutorService.java:200)
at org.jclouds.http.internal.BaseHttpCommandExecutorService$HttpResponseCallable.call(BaseHttpCommandExecutorService.java:165)
at org.jclouds.http.internal.BaseHttpCommandExecutorService$HttpResponseCallable.call(BaseHttpCommandExecutorService.java:134)
at java.util.concurrent.FutureTask$Sync.innerRun(FutureTask.java:303)
at java.util.concurrent.FutureTask.run(FutureTask.java:138)
at java.util.concurrent.ThreadPoolExecutor$Worker.runTask(ThreadPoolExecutor.java:886)
at java.util.concurrent.ThreadPoolExecutor$Worker.run(ThreadPoolExecutor.java:908)
at java.lang.Thread.run(Thread.java:680)
at org.jclouds.concurrent.config.ExecutorServiceModule$DescribingExecutorService.submit(ExecutorServiceModule.java:182)
at org.jclouds.http.internal.BaseHttpCommandExecutorService.submit(BaseHttpCommandExecutorService.java:131)
at org.jclouds.http.TransformingHttpCommandExecutorServiceImpl.submit(TransformingHttpCommandExecutorServiceImpl.java:54)
at org.jclouds.http.TransformingHttpCommandImpl.execute(TransformingHttpCommandImpl.java:73)
at org.jclouds.rest.internal.AsyncRestClientProxy.createListenableFuture(AsyncRestClientProxy.java:156)
at org.jclouds.rest.internal.AsyncRestClientProxy.invoke(AsyncRestClientProxy.java:126)
at $Proxy65.createServer(Unknown Source)
at sun.reflect.NativeMethodAccessorImpl.invoke0(Native Method)
at sun.reflect.NativeMethodAccessorImpl.invoke(NativeMethodAccessorImpl.java:39)
at sun.reflect.DelegatingMethodAccessorImpl.invoke(DelegatingMethodAccessorImpl.java:25)
at java.lang.reflect.Method.invoke(Method.java:597)
at org.jclouds.concurrent.internal.SyncProxy.invoke(SyncProxy.java:137)
at $Proxy66.createServer(Unknown Source)
at org.jclouds.rimuhosting.miro.compute.strategy.RimuHostingCreateNodeWithGroupEncodedIntoName.createNodeWithGroupEncodedIntoName(RimuHostingCreateNodeWithGroupEncodedIntoName.java:58)
at org.jclouds.compute.strategy.impl.CreateNodesWithGroupEncodedIntoNameThenAddToSet$AddNode.call(CreateNodesWithGroupEncodedIntoNameThenAddToSet.java:80)
at org.jclouds.compute.strategy.impl.CreateNodesWithGroupEncodedIntoNameThenAddToSet$AddNode.call(CreateNodesWithGroupEncodedIntoNameThenAddToSet.java:63)
at java.util.concurrent.FutureTask$Sync.innerRun(FutureTask.java:303)
at java.util.concurrent.FutureTask.run(FutureTask.java:138)
at java.util.concurrent.ThreadPoolExecutor$Worker.runTask(ThreadPoolExecutor.java:886)
at java.util.concurrent.ThreadPoolExecutor$Worker.run(ThreadPoolExecutor.java:908)
at java.lang.Thread.run(Thread.java:680)
at org.jclouds.concurrent.config.ExecutorServiceModule$DescribingExecutorService.submit(ExecutorServiceModule.java:182)
at org.jclouds.compute.strategy.impl.CreateNodesWithGroupEncodedIntoNameThenAddToSet.execute(CreateNodesWithGroupEncodedIntoNameThenAddToSet.java:123)
at org.jclouds.compute.internal.BaseComputeService.createNodesInGroup(BaseComputeService.java:199)
at org.jclouds.compute.internal.BaseComputeService.createNodesInGroup(BaseComputeService.java:215)
at org.jclouds.compute.BaseComputeServiceLiveTest.testAScriptExecutionAfterBootWithBasicTemplate(BaseComputeServiceLiveTest.java:230)
at sun.reflect.NativeMethodAccessorImpl.invoke0(Native Method)
at sun.reflect.NativeMethodAccessorImpl.invoke(NativeMethodAccessorImpl.java:39)
at sun.reflect.DelegatingMethodAccessorImpl.invoke(DelegatingMethodAccessorImpl.java:25)
at java.lang.reflect.Method.invoke(Method.java:597)
at org.testng.internal.MethodInvocationHelper.invokeMethod(MethodInvocationHelper.java:80)
at org.testng.internal.Invoker.invokeMethod(Invoker.java:691)
at org.testng.internal.Invoker.invokeTestMethod(Invoker.java:883)
at org.testng.internal.Invoker.invokeTestMethods(Invoker.java:1208)
at org.testng.internal.TestMethodWorker.invokeTestMethods(TestMethodWorker.java:127)
at org.testng.internal.TestMethodWorker.run(TestMethodWorker.java:111)
at org.testng.TestRunner.privateRun(TestRunner.java:758)
at org.testng.TestRunner.run(TestRunner.java:613)
at org.testng.SuiteRunner.runTest(SuiteRunner.java:334)
at org.testng.SuiteRunner.access$000(SuiteRunner.java:37)
at org.testng.SuiteRunner$SuiteWorker.run(SuiteRunner.java:368)
at org.testng.internal.thread.ThreadUtil$CountDownLatchedRunnable.run(ThreadUtil.java:165)
at java.util.concurrent.ThreadPoolExecutor$Worker.runTask(ThreadPoolExecutor.java:886)
at java.util.concurrent.ThreadPoolExecutor$Worker.run(ThreadPoolExecutor.java:908)
at java.lang.Thread.run(Thread.java:680)
at org.jclouds.concurrent.config.ExecutorServiceModule$DescribingExecutorService.submit(ExecutorServiceModule.java:182)
at org.jclouds.compute.strategy.impl.CreateNodesWithGroupEncodedIntoNameThenAddToSet.execute(CreateNodesWithGroupEncodedIntoNameThenAddToSet.java:123)
at org.jclouds.compute.internal.BaseComputeService.createNodesInGroup(BaseComputeService.java:199)
at org.jclouds.compute.internal.BaseComputeService.createNodesInGroup(BaseComputeService.java:215)
at org.jclouds.compute.BaseComputeServiceLiveTest.testAScriptExecutionAfterBootWithBasicTemplate(BaseComputeServiceLiveTest.java:230)
at sun.reflect.NativeMethodAccessorImpl.invoke0(Native Method)
at sun.reflect.NativeMethodAccessorImpl.invoke(NativeMethodAccessorImpl.java:39)
at sun.reflect.DelegatingMethodAccessorImpl.invoke(DelegatingMethodAccessorImpl.java:25)
at java.lang.reflect.Method.invoke(Method.java:597)
at org.testng.internal.MethodInvocationHelper.invokeMethod(MethodInvocationHelper.java:80)
at org.testng.internal.Invoker.invokeMethod(Invoker.java:691)
at org.testng.internal.Invoker.invokeTestMethod(Invoker.java:883)
at org.testng.internal.Invoker.invokeTestMethods(Invoker.java:1208)
at org.testng.internal.TestMethodWorker.invokeTestMethods(TestMethodWorker.java:127)
at org.testng.internal.TestMethodWorker.run(TestMethodWorker.java:111)
at org.testng.TestRunner.privateRun(TestRunner.java:758)
at org.testng.TestRunner.run(TestRunner.java:613)
at org.testng.SuiteRunner.runTest(SuiteRunner.java:334)
at org.testng.SuiteRunner.access$000(SuiteRunner.java:37)
at org.testng.SuiteRunner$SuiteWorker.run(SuiteRunner.java:368)
at org.testng.internal.thread.ThreadUtil$CountDownLatchedRunnable.run(ThreadUtil.java:165)
at java.util.concurrent.ThreadPoolExecutor$Worker.runTask(ThreadPoolExecutor.java:886)
at java.util.concurrent.ThreadPoolExecutor$Worker.run(ThreadPoolExecutor.java:908)
at java.lang.Thread.run(Thread.java:680)
at org.jclouds.concurrent.config.ExecutorServiceModule$DescribingExecutorService.submit(ExecutorServiceModule.java:182)
at org.jclouds.http.internal.BaseHttpCommandExecutorService.submit(BaseHttpCommandExecutorService.java:131)
at org.jclouds.http.TransformingHttpCommandExecutorServiceImpl.submit(TransformingHttpCommandExecutorServiceImpl.java:54)
at org.jclouds.http.TransformingHttpCommandImpl.execute(TransformingHttpCommandImpl.java:73)
at org.jclouds.rest.internal.AsyncRestClientProxy.createListenableFuture(AsyncRestClientProxy.java:156)
at org.jclouds.rest.internal.AsyncRestClientProxy.invoke(AsyncRestClientProxy.java:126)
at $Proxy65.createServer(Unknown Source)
at sun.reflect.NativeMethodAccessorImpl.invoke0(Native Method)
at sun.reflect.NativeMethodAccessorImpl.invoke(NativeMethodAccessorImpl.java:39)
at sun.reflect.DelegatingMethodAccessorImpl.invoke(DelegatingMethodAccessorImpl.java:25)
at java.lang.reflect.Method.invoke(Method.java:597)
at org.jclouds.concurrent.internal.SyncProxy.invoke(SyncProxy.java:137)
at $Proxy66.createServer(Unknown Source)
at org.jclouds.rimuhosting.miro.compute.strategy.RimuHostingCreateNodeWithGroupEncodedIntoName.createNodeWithGroupEncodedIntoName(RimuHostingCreateNodeWithGroupEncodedIntoName.java:58)
at org.jclouds.compute.strategy.impl.CreateNodesWithGroupEncodedIntoNameThenAddToSet$AddNode.call(CreateNodesWithGroupEncodedIntoNameThenAddToSet.java:80)
at org.jclouds.compute.strategy.impl.CreateNodesWithGroupEncodedIntoNameThenAddToSet$AddNode.call(CreateNodesWithGroupEncodedIntoNameThenAddToSet.java:63)
at java.util.concurrent.FutureTask$Sync.innerRun(FutureTask.java:303)
at java.util.concurrent.FutureTask.run(FutureTask.java:138)
at java.util.concurrent.ThreadPoolExecutor$Worker.runTask(ThreadPoolExecutor.java:886)
at java.util.concurrent.ThreadPoolExecutor$Worker.run(ThreadPoolExecutor.java:908)
at java.lang.Thread.run(Thread.java:680)
at org.jclouds.concurrent.config.ExecutorServiceModule$DescribingExecutorService.submit(ExecutorServiceModule.java:182)
at org.jclouds.http.internal.BaseHttpCommandExecutorService.submit(BaseHttpCommandExecutorService.java:131)
at org.jclouds.http.TransformingHttpCommandExecutorServiceImpl.submit(TransformingHttpCommandExecutorServiceImpl.java:54)
at org.jclouds.http.TransformingHttpCommandImpl.execute(TransformingHttpCommandImpl.java:73)
at org.jclouds.rest.internal.AsyncRestClientProxy.createListenableFuture(AsyncRestClientProxy.java:156)
at org.jclouds.rest.internal.AsyncRestClientProxy.invoke(AsyncRestClientProxy.java:126)
at $Proxy65.createServer(Unknown Source)
at sun.reflect.NativeMethodAccessorImpl.invoke0(Native Method)
at sun.reflect.NativeMethodAccessorImpl.invoke(NativeMethodAccessorImpl.java:39)
at sun.reflect.DelegatingMethodAccessorImpl.invoke(DelegatingMethodAccessorImpl.java:25)
at java.lang.reflect.Method.invoke(Method.java:597)
at org.jclouds.concurrent.internal.SyncProxy.invoke(SyncProxy.java:137)
at $Proxy66.createServer(Unknown Source)
at org.jclouds.rimuhosting.miro.compute.strategy.RimuHostingCreateNodeWithGroupEncodedIntoName.createNodeWithGroupEncodedIntoName(RimuHostingCreateNodeWithGroupEncodedIntoName.java:58)
at org.jclouds.compute.strategy.impl.CreateNodesWithGroupEncodedIntoNameThenAddToSet$AddNode.call(CreateNodesWithGroupEncodedIntoNameThenAddToSet.java:80)
at org.jclouds.compute.strategy.impl.CreateNodesWithGroupEncodedIntoNameThenAddToSet$AddNode.call(CreateNodesWithGroupEncodedIntoNameThenAddToSet.java:63)
at java.util.concurrent.FutureTask$Sync.innerRun(FutureTask.java:303)
at java.util.concurrent.FutureTask.run(FutureTask.java:138)
... 3 more
1 error[s]
Node failures:
0 error[s]
at org.jclouds.compute.internal.BaseComputeService.createNodesInGroup(BaseComputeService.java:207)
at org.jclouds.compute.internal.BaseComputeService.createNodesInGroup(BaseComputeService.java:215)
at org.jclouds.compute.BaseComputeServiceLiveTest.testAScriptExecutionAfterBootWithBasicTemplate(BaseComputeServiceLiveTest.java:230)
at sun.reflect.NativeMethodAccessorImpl.invoke0(Native Method)
at sun.reflect.NativeMethodAccessorImpl.invoke(NativeMethodAccessorImpl.java:39)
at sun.reflect.DelegatingMethodAccessorImpl.invoke(DelegatingMethodAccessorImpl.java:25)
at java.lang.reflect.Method.invoke(Method.java:597)
at org.testng.internal.MethodInvocationHelper.invokeMethod(MethodInvocationHelper.java:80)
at org.testng.internal.Invoker.invokeMethod(Invoker.java:691)
at org.testng.internal.Invoker.invokeTestMethod(Invoker.java:883)
at org.testng.internal.Invoker.invokeTestMethods(Invoker.java:1208)
at org.testng.internal.TestMethodWorker.invokeTestMethods(TestMethodWorker.java:127)
at org.testng.internal.TestMethodWorker.run(TestMethodWorker.java:111)
at org.testng.TestRunner.privateRun(TestRunner.java:758)
at org.testng.TestRunner.run(TestRunner.java:613)
at org.testng.SuiteRunner.runTest(SuiteRunner.java:334)
at org.testng.SuiteRunner.access$000(SuiteRunner.java:37)
at org.testng.SuiteRunner$SuiteWorker.run(SuiteRunner.java:368)
at org.testng.internal.thread.ThreadUtil$CountDownLatchedRunnable.run(ThreadUtil.java:165)
at java.util.concurrent.ThreadPoolExecutor$Worker.runTask(ThreadPoolExecutor.java:886)
at java.util.concurrent.ThreadPoolExecutor$Worker.run(ThreadPoolExecutor.java:908)
at java.lang.Thread.run(Thread.java:680)
Caused by: org.jclouds.http.HttpResponseException: command: POST https://api.rimuhosting.com/r/orders/new-vps HTTP/1.1 failed with response: HTTP/1.1 406 Not Acceptable; content: [{ "post_new_vps_response" : { "status_message" : "Not Acceptable"
, "status_code" : 406
, "response_created_time" : { "ms_since_epoch": 1326650768829, "iso_format" : "2012-01-15T18:06:08Z", "users_tz_offset_ms" : 46800000}
, "response_created_time_epoch_ms" : 1326650768829
, "error_info" : { "error_class" : "ValidationError"
, "full_error_message" : "memory_mb: The 64 bit distros require a good amount of memory. Try 256MB or more."
, "human_readable_message" : "The 64 bit distros require a good amount of memory. Try 256MB or more."
, "error_title" : "Validation Problem"
, "field_name" : "memory_mb"}
, "extended_error_infos" : [{ "error_class" : "ValidationError"
, "full_error_message" : "memory_mb: The 64 bit distros require a good amount of memory. Try 256MB or more."
, "human_readable_message" : "The 64 bit distros require a good amount of memory. Try 256MB or more."
, "error_title" : "Validation Problem"
, "field_name" : "memory_mb"}]
, "response_type" : "ERROR"
, "human_readable_message" : "The 64 bit distros require a good amount of memory. Try 256MB or more."
, "redirect_uri" : null
, "response_display_duration_type" : "REGULAR"
, "setup_messages" : ["Selected user as the logged in user: Ivan Meredith"
, "Selected billing details as the first 'wire' billing details found for the user: Wire Transfer"
, "No VPS paramters provided, using default values."
, "'memory_mb' not provided, setting to 160MB."
, "'disk_space_mb' not provided, setting to 4GB."
, "memory_mb: The 64 bit distros require a good amount of memory. Try 256MB or more."]
, "about_order" : null
, "new_order_request" : { "billing_oid" : 0
, "user_oid" : 0
, "host_server_oid" : null
, "ip_request" : null
, "vps_parameters" : null
, "pricing_plan_code" : "MIRO4B"
, "dc_location" : null
, "vps_type" : null
, "instantiation_options" : { "domain_name" : "rimuhosting.jcloudsr-291"
, "control_panel" : "none"
, "password" : "rezeru87"
, "distro" : "ubuntu1110.64"}
, "instantiation_via_clone_options" : null
, "file_injection_data" : null
, "meta_data" : []}
, "running_vps_info" : null}}
]
at org.jclouds.http.handlers.CloseContentAndSetExceptionErrorHandler.handleError(CloseContentAndSetExceptionErrorHandler.java:44)
at org.jclouds.http.handlers.DelegatingErrorHandler.handleError(DelegatingErrorHandler.java:69)
at org.jclouds.http.internal.BaseHttpCommandExecutorService$HttpResponseCallable.shouldContinue(BaseHttpCommandExecutorService.java:200)
at org.jclouds.http.internal.BaseHttpCommandExecutorService$HttpResponseCallable.call(BaseHttpCommandExecutorService.java:165)
at org.jclouds.http.internal.BaseHttpCommandExecutorService$HttpResponseCallable.call(BaseHttpCommandExecutorService.java:134)
at java.util.concurrent.FutureTask$Sync.innerRun(FutureTask.java:303)
at java.util.concurrent.FutureTask.run(FutureTask.java:138)
at java.util.concurrent.ThreadPoolExecutor$Worker.runTask(ThreadPoolExecutor.java:886)
at java.util.concurrent.ThreadPoolExecutor$Worker.run(ThreadPoolExecutor.java:908)
at java.lang.Thread.run(Thread.java:680)
at org.jclouds.concurrent.config.ExecutorServiceModule$DescribingExecutorService.submit(ExecutorServiceModule.java:182)
at org.jclouds.http.internal.BaseHttpCommandExecutorService.submit(BaseHttpCommandExecutorService.java:131)
at org.jclouds.http.TransformingHttpCommandExecutorServiceImpl.submit(TransformingHttpCommandExecutorServiceImpl.java:54)
at org.jclouds.http.TransformingHttpCommandImpl.execute(TransformingHttpCommandImpl.java:73)
at org.jclouds.rest.internal.AsyncRestClientProxy.createListenableFuture(AsyncRestClientProxy.java:156)
at org.jclouds.rest.internal.AsyncRestClientProxy.invoke(AsyncRestClientProxy.java:126)
at $Proxy65.createServer(Unknown Source)
at sun.reflect.NativeMethodAccessorImpl.invoke0(Native Method)
at sun.reflect.NativeMethodAccessorImpl.invoke(NativeMethodAccessorImpl.java:39)
at sun.reflect.DelegatingMethodAccessorImpl.invoke(DelegatingMethodAccessorImpl.java:25)
at java.lang.reflect.Method.invoke(Method.java:597)
at org.jclouds.concurrent.internal.SyncProxy.invoke(SyncProxy.java:137)
at $Proxy66.createServer(Unknown Source)
at org.jclouds.rimuhosting.miro.compute.strategy.RimuHostingCreateNodeWithGroupEncodedIntoName.createNodeWithGroupEncodedIntoName(RimuHostingCreateNodeWithGroupEncodedIntoName.java:58)
at org.jclouds.compute.strategy.impl.CreateNodesWithGroupEncodedIntoNameThenAddToSet$AddNode.call(CreateNodesWithGroupEncodedIntoNameThenAddToSet.java:80)
at org.jclouds.compute.strategy.impl.CreateNodesWithGroupEncodedIntoNameThenAddToSet$AddNode.call(CreateNodesWithGroupEncodedIntoNameThenAddToSet.java:63)
at java.util.concurrent.FutureTask$Sync.innerRun(FutureTask.java:303)
at java.util.concurrent.FutureTask.run(FutureTask.java:138)
at java.util.concurrent.ThreadPoolExecutor$Worker.runTask(ThreadPoolExecutor.java:886)
at java.util.concurrent.ThreadPoolExecutor$Worker.run(ThreadPoolExecutor.java:908)
at java.lang.Thread.run(Thread.java:680)
at org.jclouds.concurrent.config.ExecutorServiceModule$DescribingExecutorService.submit(ExecutorServiceModule.java:182)
at org.jclouds.compute.strategy.impl.CreateNodesWithGroupEncodedIntoNameThenAddToSet.execute(CreateNodesWithGroupEncodedIntoNameThenAddToSet.java:123)
at org.jclouds.compute.internal.BaseComputeService.createNodesInGroup(BaseComputeService.java:199)
at org.jclouds.compute.internal.BaseComputeService.createNodesInGroup(BaseComputeService.java:215)
at org.jclouds.compute.BaseComputeServiceLiveTest.testAScriptExecutionAfterBootWithBasicTemplate(BaseComputeServiceLiveTest.java:230)
at sun.reflect.NativeMethodAccessorImpl.invoke0(Native Method)
at sun.reflect.NativeMethodAccessorImpl.invoke(NativeMethodAccessorImpl.java:39)
at sun.reflect.DelegatingMethodAccessorImpl.invoke(DelegatingMethodAccessorImpl.java:25)
at java.lang.reflect.Method.invoke(Method.java:597)
at org.testng.internal.MethodInvocationHelper.invokeMethod(MethodInvocationHelper.java:80)
at org.testng.internal.Invoker.invokeMethod(Invoker.java:691)
at org.testng.internal.Invoker.invokeTestMethod(Invoker.java:883)
at org.testng.internal.Invoker.invokeTestMethods(Invoker.java:1208)
at org.testng.internal.TestMethodWorker.invokeTestMethods(TestMethodWorker.java:127)
at org.testng.internal.TestMethodWorker.run(TestMethodWorker.java:111)
at org.testng.TestRunner.privateRun(TestRunner.java:758)
at org.testng.TestRunner.run(TestRunner.java:613)
at org.testng.SuiteRunner.runTest(SuiteRunner.java:334)
at org.testng.SuiteRunner.access$000(SuiteRunner.java:37)
at org.testng.SuiteRunner$SuiteWorker.run(SuiteRunner.java:368)
at org.testng.internal.thread.ThreadUtil$CountDownLatchedRunnable.run(ThreadUtil.java:165)
at java.util.concurrent.ThreadPoolExecutor$Worker.runTask(ThreadPoolExecutor.java:886)
at java.util.concurrent.ThreadPoolExecutor$Worker.run(ThreadPoolExecutor.java:908)
at java.lang.Thread.run(Thread.java:680)
at org.jclouds.concurrent.config.ExecutorServiceModule$DescribingExecutorService.submit(ExecutorServiceModule.java:182)
at org.jclouds.compute.strategy.impl.CreateNodesWithGroupEncodedIntoNameThenAddToSet.execute(CreateNodesWithGroupEncodedIntoNameThenAddToSet.java:123)
at org.jclouds.compute.internal.BaseComputeService.createNodesInGroup(BaseComputeService.java:199)
at org.jclouds.compute.internal.BaseComputeService.createNodesInGroup(BaseComputeService.java:215)
at org.jclouds.compute.BaseComputeServiceLiveTest.testAScriptExecutionAfterBootWithBasicTemplate(BaseComputeServiceLiveTest.java:230)
at sun.reflect.NativeMethodAccessorImpl.invoke0(Native Method)
at sun.reflect.NativeMethodAccessorImpl.invoke(NativeMethodAccessorImpl.java:39)
at sun.reflect.DelegatingMethodAccessorImpl.invoke(DelegatingMethodAccessorImpl.java:25)
at java.lang.reflect.Method.invoke(Method.java:597)
at org.testng.internal.MethodInvocationHelper.invokeMethod(MethodInvocationHelper.java:80)
at org.testng.internal.Invoker.invokeMethod(Invoker.java:691)
at org.testng.internal.Invoker.invokeTestMethod(Invoker.java:883)
at org.testng.internal.Invoker.invokeTestMethods(Invoker.java:1208)
at org.testng.internal.TestMethodWorker.invokeTestMethods(TestMethodWorker.java:127)
at org.testng.internal.TestMethodWorker.run(TestMethodWorker.java:111)
at org.testng.TestRunner.privateRun(TestRunner.java:758)
at org.testng.TestRunner.run(TestRunner.java:613)
at org.testng.SuiteRunner.runTest(SuiteRunner.java:334)
at org.testng.SuiteRunner.access$000(SuiteRunner.java:37)
at org.testng.SuiteRunner$SuiteWorker.run(SuiteRunner.java:368)
at org.testng.internal.thread.ThreadUtil$CountDownLatchedRunnable.run(ThreadUtil.java:165)
at java.util.concurrent.ThreadPoolExecutor$Worker.runTask(ThreadPoolExecutor.java:886)
at java.util.concurrent.ThreadPoolExecutor$Worker.run(ThreadPoolExecutor.java:908)
at java.lang.Thread.run(Thread.java:680)
at org.jclouds.concurrent.config.ExecutorServiceModule$DescribingExecutorService.submit(ExecutorServiceModule.java:182)
at org.jclouds.http.internal.BaseHttpCommandExecutorService.submit(BaseHttpCommandExecutorService.java:131)
at org.jclouds.http.TransformingHttpCommandExecutorServiceImpl.submit(TransformingHttpCommandExecutorServiceImpl.java:54)
at org.jclouds.http.TransformingHttpCommandImpl.execute(TransformingHttpCommandImpl.java:73)
at org.jclouds.rest.internal.AsyncRestClientProxy.createListenableFuture(AsyncRestClientProxy.java:156)
at org.jclouds.rest.internal.AsyncRestClientProxy.invoke(AsyncRestClientProxy.java:126)
at $Proxy65.createServer(Unknown Source)
at sun.reflect.NativeMethodAccessorImpl.invoke0(Native Method)
at sun.reflect.NativeMethodAccessorImpl.invoke(NativeMethodAccessorImpl.java:39)
at sun.reflect.DelegatingMethodAccessorImpl.invoke(DelegatingMethodAccessorImpl.java:25)
at java.lang.reflect.Method.invoke(Method.java:597)
at org.jclouds.concurrent.internal.SyncProxy.invoke(SyncProxy.java:137)
at $Proxy66.createServer(Unknown Source)
at org.jclouds.rimuhosting.miro.compute.strategy.RimuHostingCreateNodeWithGroupEncodedIntoName.createNodeWithGroupEncodedIntoName(RimuHostingCreateNodeWithGroupEncodedIntoName.java:58)
at org.jclouds.compute.strategy.impl.CreateNodesWithGroupEncodedIntoNameThenAddToSet$AddNode.call(CreateNodesWithGroupEncodedIntoNameThenAddToSet.java:80)
at org.jclouds.compute.strategy.impl.CreateNodesWithGroupEncodedIntoNameThenAddToSet$AddNode.call(CreateNodesWithGroupEncodedIntoNameThenAddToSet.java:63)
at java.util.concurrent.FutureTask$Sync.innerRun(FutureTask.java:303)
at java.util.concurrent.FutureTask.run(FutureTask.java:138)
at java.util.concurrent.ThreadPoolExecutor$Worker.runTask(ThreadPoolExecutor.java:886)
at java.util.concurrent.ThreadPoolExecutor$Worker.run(ThreadPoolExecutor.java:908)
at java.lang.Thread.run(Thread.java:680)
at org.jclouds.concurrent.config.ExecutorServiceModule$DescribingExecutorService.submit(ExecutorServiceModule.java:182)
at org.jclouds.http.internal.BaseHttpCommandExecutorService.submit(BaseHttpCommandExecutorService.java:131)
at org.jclouds.http.TransformingHttpCommandExecutorServiceImpl.submit(TransformingHttpCommandExecutorServiceImpl.java:54)
at org.jclouds.http.TransformingHttpCommandImpl.execute(TransformingHttpCommandImpl.java:73)
at org.jclouds.rest.internal.AsyncRestClientProxy.createListenableFuture(AsyncRestClientProxy.java:156)
at org.jclouds.rest.internal.AsyncRestClientProxy.invoke(AsyncRestClientProxy.java:126)
at $Proxy65.createServer(Unknown Source)
at sun.reflect.NativeMethodAccessorImpl.invoke0(Native Method)
at sun.reflect.NativeMethodAccessorImpl.invoke(NativeMethodAccessorImpl.java:39)
at sun.reflect.DelegatingMethodAccessorImpl.invoke(DelegatingMethodAccessorImpl.java:25)
at java.lang.reflect.Method.invoke(Method.java:597)
at org.jclouds.concurrent.internal.SyncProxy.invoke(SyncProxy.java:137)
at $Proxy66.createServer(Unknown Source)
at org.jclouds.rimuhosting.miro.compute.strategy.RimuHostingCreateNodeWithGroupEncodedIntoName.createNodeWithGroupEncodedIntoName(RimuHostingCreateNodeWithGroupEncodedIntoName.java:58)
at org.jclouds.compute.strategy.impl.CreateNodesWithGroupEncodedIntoNameThenAddToSet$AddNode.call(CreateNodesWithGroupEncodedIntoNameThenAddToSet.java:80)
at org.jclouds.compute.strategy.impl.CreateNodesWithGroupEncodedIntoNameThenAddToSet$AddNode.call(CreateNodesWithGroupEncodedIntoNameThenAddToSet.java:63)
at java.util.concurrent.FutureTask$Sync.innerRun(FutureTask.java:303)
at java.util.concurrent.FutureTask.run(FutureTask.java:138)
... 3 more
1 error[s]
Node failures:
0 error[s]
at org.jclouds.compute.internal.BaseComputeService.createNodesInGroup(BaseComputeService.java:207)
at org.jclouds.compute.internal.BaseComputeService.createNodesInGroup(BaseComputeService.java:215)
at org.jclouds.compute.BaseComputeServiceLiveTest.testAScriptExecutionAfterBootWithBasicTemplate(BaseComputeServiceLiveTest.java:230)
at sun.reflect.NativeMethodAccessorImpl.invoke0(Native Method)
at sun.reflect.NativeMethodAccessorImpl.invoke(NativeMethodAccessorImpl.java:39)
at sun.reflect.DelegatingMethodAccessorImpl.invoke(DelegatingMethodAccessorImpl.java:25)
at java.lang.reflect.Method.invoke(Method.java:597)
at org.testng.internal.MethodInvocationHelper.invokeMethod(MethodInvocationHelper.java:80)
at org.testng.internal.Invoker.invokeMethod(Invoker.java:691)
at org.testng.internal.Invoker.invokeTestMethod(Invoker.java:883)
at org.testng.internal.Invoker.invokeTestMethods(Invoker.java:1208)
at org.testng.internal.TestMethodWorker.invokeTestMethods(TestMethodWorker.java:127)
at org.testng.internal.TestMethodWorker.run(TestMethodWorker.java:111)
at org.testng.TestRunner.privateRun(TestRunner.java:758)
at org.testng.TestRunner.run(TestRunner.java:613)
at org.testng.SuiteRunner.runTest(SuiteRunner.java:334)
at org.testng.SuiteRunner.access$000(SuiteRunner.java:37)
at org.testng.SuiteRunner$SuiteWorker.run(SuiteRunner.java:368)
at org.testng.internal.thread.ThreadUtil$CountDownLatchedRunnable.run(ThreadUtil.java:165)
at java.util.concurrent.ThreadPoolExecutor$Worker.runTask(ThreadPoolExecutor.java:886)
at java.util.concurrent.ThreadPoolExecutor$Worker.run(ThreadPoolExecutor.java:908)
at java.lang.Thread.run(Thread.java:680)
testCreateTwoNodesWithRunScript(org.jclouds.rimuhosting.miro.compute.RimuHostingComputeServiceLiveTest) Time elapsed: 1.804 sec <<< FAILURE!
org.jclouds.compute.RunNodesException: error running 2 nodes group(rimuhosting.jclouds) location(DCDALLAS) image(ubuntu1110.64) size(MIRO4B) options([inboundPorts=[22], privateKey=false, publicKey=false, runScript=true, blockUntilRunning=true, blockOnComplete=true, port:seconds=-1:-1, userMetadata: {}])
Execution failures:
1) ExecutionException on rimuhosting.jclouds-565:
java.util.concurrent.ExecutionException: org.jclouds.http.HttpResponseException: command: POST https://api.rimuhosting.com/r/orders/new-vps HTTP/1.1 failed with response: HTTP/1.1 406 Not Acceptable; content: [{ "post_new_vps_response" : { "status_message" : "Not Acceptable"
, "status_code" : 406
, "response_created_time" : { "ms_since_epoch": 1326650771130, "iso_format" : "2012-01-15T18:06:11Z", "users_tz_offset_ms" : 46800000}
, "response_created_time_epoch_ms" : 1326650771130
, "error_info" : { "error_class" : "ValidationError"
, "full_error_message" : "memory_mb: The 64 bit distros require a good amount of memory. Try 256MB or more."
, "human_readable_message" : "The 64 bit distros require a good amount of memory. Try 256MB or more."
, "error_title" : "Validation Problem"
, "field_name" : "memory_mb"}
, "extended_error_infos" : [{ "error_class" : "ValidationError"
, "full_error_message" : "memory_mb: The 64 bit distros require a good amount of memory. Try 256MB or more."
, "human_readable_message" : "The 64 bit distros require a good amount of memory. Try 256MB or more."
, "error_title" : "Validation Problem"
, "field_name" : "memory_mb"}]
, "response_type" : "ERROR"
, "human_readable_message" : "The 64 bit distros require a good amount of memory. Try 256MB or more."
, "redirect_uri" : null
, "response_display_duration_type" : "REGULAR"
, "setup_messages" : ["Selected user as the logged in user: Ivan Meredith"
, "Selected billing details as the first 'wire' billing details found for the user: Wire Transfer"
, "No VPS paramters provided, using default values."
, "'memory_mb' not provided, setting to 160MB."
, "'disk_space_mb' not provided, setting to 4GB."
, "memory_mb: The 64 bit distros require a good amount of memory. Try 256MB or more."]
, "about_order" : null
, "new_order_request" : { "billing_oid" : 0
, "user_oid" : 0
, "host_server_oid" : null
, "ip_request" : null
, "vps_parameters" : null
, "pricing_plan_code" : "MIRO4B"
, "dc_location" : null
, "vps_type" : null
, "instantiation_options" : { "domain_name" : "rimuhosting.jclouds-565"
, "control_panel" : "none"
, "password" : "faerew23"
, "distro" : "ubuntu1110.64"}
, "instantiation_via_clone_options" : null
, "file_injection_data" : null
, "meta_data" : []}
, "running_vps_info" : null}}
]
at com.google.common.util.concurrent.AbstractFuture$Sync.getValue(AbstractFuture.java:289)
at com.google.common.util.concurrent.AbstractFuture$Sync.get(AbstractFuture.java:276)
at com.google.common.util.concurrent.AbstractFuture.get(AbstractFuture.java:111)
at com.google.common.util.concurrent.Futures$ChainingListenableFuture.get(Futures.java:635)
at org.jclouds.concurrent.FutureIterables$1.run(FutureIterables.java:126)
at java.util.concurrent.ThreadPoolExecutor$Worker.runTask(ThreadPoolExecutor.java:886)
at java.util.concurrent.ThreadPoolExecutor$Worker.run(ThreadPoolExecutor.java:908)
at java.lang.Thread.run(Thread.java:680)
Caused by: org.jclouds.http.HttpResponseException: command: POST https://api.rimuhosting.com/r/orders/new-vps HTTP/1.1 failed with response: HTTP/1.1 406 Not Acceptable; content: [{ "post_new_vps_response" : { "status_message" : "Not Acceptable"
, "status_code" : 406
, "response_created_time" : { "ms_since_epoch": 1326650771130, "iso_format" : "2012-01-15T18:06:11Z", "users_tz_offset_ms" : 46800000}
, "response_created_time_epoch_ms" : 1326650771130
, "error_info" : { "error_class" : "ValidationError"
, "full_error_message" : "memory_mb: The 64 bit distros require a good amount of memory. Try 256MB or more."
, "human_readable_message" : "The 64 bit distros require a good amount of memory. Try 256MB or more."
, "error_title" : "Validation Problem"
, "field_name" : "memory_mb"}
, "extended_error_infos" : [{ "error_class" : "ValidationError"
, "full_error_message" : "memory_mb: The 64 bit distros require a good amount of memory. Try 256MB or more."
, "human_readable_message" : "The 64 bit distros require a good amount of memory. Try 256MB or more."
, "error_title" : "Validation Problem"
, "field_name" : "memory_mb"}]
, "response_type" : "ERROR"
, "human_readable_message" : "The 64 bit distros require a good amount of memory. Try 256MB or more."
, "redirect_uri" : null
, "response_display_duration_type" : "REGULAR"
, "setup_messages" : ["Selected user as the logged in user: Ivan Meredith"
, "Selected billing details as the first 'wire' billing details found for the user: Wire Transfer"
, "No VPS paramters provided, using default values."
, "'memory_mb' not provided, setting to 160MB."
, "'disk_space_mb' not provided, setting to 4GB."
, "memory_mb: The 64 bit distros require a good amount of memory. Try 256MB or more."]
, "about_order" : null
, "new_order_request" : { "billing_oid" : 0
, "user_oid" : 0
, "host_server_oid" : null
, "ip_request" : null
, "vps_parameters" : null
, "pricing_plan_code" : "MIRO4B"
, "dc_location" : null
, "vps_type" : null
, "instantiation_options" : { "domain_name" : "rimuhosting.jclouds-565"
, "control_panel" : "none"
, "password" : "faerew23"
, "distro" : "ubuntu1110.64"}
, "instantiation_via_clone_options" : null
, "file_injection_data" : null
, "meta_data" : []}
, "running_vps_info" : null}}
]
at org.jclouds.http.handlers.CloseContentAndSetExceptionErrorHandler.handleError(CloseContentAndSetExceptionErrorHandler.java:44)
at org.jclouds.http.handlers.DelegatingErrorHandler.handleError(DelegatingErrorHandler.java:69)
at org.jclouds.http.internal.BaseHttpCommandExecutorService$HttpResponseCallable.shouldContinue(BaseHttpCommandExecutorService.java:200)
at org.jclouds.http.internal.BaseHttpCommandExecutorService$HttpResponseCallable.call(BaseHttpCommandExecutorService.java:165)
at org.jclouds.http.internal.BaseHttpCommandExecutorService$HttpResponseCallable.call(BaseHttpCommandExecutorService.java:134)
at java.util.concurrent.FutureTask$Sync.innerRun(FutureTask.java:303)
at java.util.concurrent.FutureTask.run(FutureTask.java:138)
at java.util.concurrent.ThreadPoolExecutor$Worker.runTask(ThreadPoolExecutor.java:886)
at java.util.concurrent.ThreadPoolExecutor$Worker.run(ThreadPoolExecutor.java:908)
at java.lang.Thread.run(Thread.java:680)
at org.jclouds.concurrent.config.ExecutorServiceModule$DescribingExecutorService.submit(ExecutorServiceModule.java:182)
at org.jclouds.http.internal.BaseHttpCommandExecutorService.submit(BaseHttpCommandExecutorService.java:131)
at org.jclouds.http.TransformingHttpCommandExecutorServiceImpl.submit(TransformingHttpCommandExecutorServiceImpl.java:54)
at org.jclouds.http.TransformingHttpCommandImpl.execute(TransformingHttpCommandImpl.java:73)
at org.jclouds.rest.internal.AsyncRestClientProxy.createListenableFuture(AsyncRestClientProxy.java:156)
at org.jclouds.rest.internal.AsyncRestClientProxy.invoke(AsyncRestClientProxy.java:126)
at $Proxy65.createServer(Unknown Source)
at sun.reflect.NativeMethodAccessorImpl.invoke0(Native Method)
at sun.reflect.NativeMethodAccessorImpl.invoke(NativeMethodAccessorImpl.java:39)
at sun.reflect.DelegatingMethodAccessorImpl.invoke(DelegatingMethodAccessorImpl.java:25)
at java.lang.reflect.Method.invoke(Method.java:597)
at org.jclouds.concurrent.internal.SyncProxy.invoke(SyncProxy.java:137)
at $Proxy66.createServer(Unknown Source)
at org.jclouds.rimuhosting.miro.compute.strategy.RimuHostingCreateNodeWithGroupEncodedIntoName.createNodeWithGroupEncodedIntoName(RimuHostingCreateNodeWithGroupEncodedIntoName.java:58)
at org.jclouds.compute.strategy.impl.CreateNodesWithGroupEncodedIntoNameThenAddToSet$AddNode.call(CreateNodesWithGroupEncodedIntoNameThenAddToSet.java:80)
at org.jclouds.compute.strategy.impl.CreateNodesWithGroupEncodedIntoNameThenAddToSet$AddNode.call(CreateNodesWithGroupEncodedIntoNameThenAddToSet.java:63)
at java.util.concurrent.FutureTask$Sync.innerRun(FutureTask.java:303)
at java.util.concurrent.FutureTask.run(FutureTask.java:138)
at java.util.concurrent.ThreadPoolExecutor$Worker.runTask(ThreadPoolExecutor.java:886)
at java.util.concurrent.ThreadPoolExecutor$Worker.run(ThreadPoolExecutor.java:908)
at java.lang.Thread.run(Thread.java:680)
at org.jclouds.concurrent.config.ExecutorServiceModule$DescribingExecutorService.submit(ExecutorServiceModule.java:182)
at org.jclouds.http.internal.BaseHttpCommandExecutorService.submit(BaseHttpCommandExecutorService.java:131)
at org.jclouds.http.TransformingHttpCommandExecutorServiceImpl.submit(TransformingHttpCommandExecutorServiceImpl.java:54)
at org.jclouds.http.TransformingHttpCommandImpl.execute(TransformingHttpCommandImpl.java:73)
at org.jclouds.rest.internal.AsyncRestClientProxy.createListenableFuture(AsyncRestClientProxy.java:156)
at org.jclouds.rest.internal.AsyncRestClientProxy.invoke(AsyncRestClientProxy.java:126)
at $Proxy65.createServer(Unknown Source)
at sun.reflect.NativeMethodAccessorImpl.invoke0(Native Method)
at sun.reflect.NativeMethodAccessorImpl.invoke(NativeMethodAccessorImpl.java:39)
at sun.reflect.DelegatingMethodAccessorImpl.invoke(DelegatingMethodAccessorImpl.java:25)
at java.lang.reflect.Method.invoke(Method.java:597)
at org.jclouds.concurrent.internal.SyncProxy.invoke(SyncProxy.java:137)
at $Proxy66.createServer(Unknown Source)
at org.jclouds.rimuhosting.miro.compute.strategy.RimuHostingCreateNodeWithGroupEncodedIntoName.createNodeWithGroupEncodedIntoName(RimuHostingCreateNodeWithGroupEncodedIntoName.java:58)
at org.jclouds.compute.strategy.impl.CreateNodesWithGroupEncodedIntoNameThenAddToSet$AddNode.call(CreateNodesWithGroupEncodedIntoNameThenAddToSet.java:80)
at org.jclouds.compute.strategy.impl.CreateNodesWithGroupEncodedIntoNameThenAddToSet$AddNode.call(CreateNodesWithGroupEncodedIntoNameThenAddToSet.java:63)
at java.util.concurrent.FutureTask$Sync.innerRun(FutureTask.java:303)
at java.util.concurrent.FutureTask.run(FutureTask.java:138)
at java.util.concurrent.ThreadPoolExecutor$Worker.runTask(ThreadPoolExecutor.java:886)
at java.util.concurrent.ThreadPoolExecutor$Worker.run(ThreadPoolExecutor.java:908)
at java.lang.Thread.run(Thread.java:680)
at org.jclouds.concurrent.config.ExecutorServiceModule$DescribingExecutorService.submit(ExecutorServiceModule.java:182)
at org.jclouds.compute.strategy.impl.CreateNodesWithGroupEncodedIntoNameThenAddToSet.execute(CreateNodesWithGroupEncodedIntoNameThenAddToSet.java:123)
at org.jclouds.compute.internal.BaseComputeService.createNodesInGroup(BaseComputeService.java:199)
at org.jclouds.compute.BaseComputeServiceLiveTest.testCreateTwoNodesWithRunScript(BaseComputeServiceLiveTest.java:350)
at sun.reflect.NativeMethodAccessorImpl.invoke0(Native Method)
at sun.reflect.NativeMethodAccessorImpl.invoke(NativeMethodAccessorImpl.java:39)
at sun.reflect.DelegatingMethodAccessorImpl.invoke(DelegatingMethodAccessorImpl.java:25)
at java.lang.reflect.Method.invoke(Method.java:597)
at org.testng.internal.MethodInvocationHelper.invokeMethod(MethodInvocationHelper.java:80)
at org.testng.internal.Invoker.invokeMethod(Invoker.java:691)
at org.testng.internal.Invoker.invokeTestMethod(Invoker.java:883)
at org.testng.internal.Invoker.invokeTestMethods(Invoker.java:1208)
at org.testng.internal.TestMethodWorker.invokeTestMethods(TestMethodWorker.java:127)
at org.testng.internal.TestMethodWorker.run(TestMethodWorker.java:111)
at org.testng.TestRunner.privateRun(TestRunner.java:758)
at org.testng.TestRunner.run(TestRunner.java:613)
at org.testng.SuiteRunner.runTest(SuiteRunner.java:334)
at org.testng.SuiteRunner.access$000(SuiteRunner.java:37)
at org.testng.SuiteRunner$SuiteWorker.run(SuiteRunner.java:368)
at org.testng.internal.thread.ThreadUtil$CountDownLatchedRunnable.run(ThreadUtil.java:165)
at java.util.concurrent.ThreadPoolExecutor$Worker.runTask(ThreadPoolExecutor.java:886)
at java.util.concurrent.ThreadPoolExecutor$Worker.run(ThreadPoolExecutor.java:908)
at java.lang.Thread.run(Thread.java:680)
at org.jclouds.concurrent.config.ExecutorServiceModule$DescribingExecutorService.submit(ExecutorServiceModule.java:182)
at org.jclouds.http.internal.BaseHttpCommandExecutorService.submit(BaseHttpCommandExecutorService.java:131)
at org.jclouds.http.TransformingHttpCommandExecutorServiceImpl.submit(TransformingHttpCommandExecutorServiceImpl.java:54)
at org.jclouds.http.TransformingHttpCommandImpl.execute(TransformingHttpCommandImpl.java:73)
at org.jclouds.rest.internal.AsyncRestClientProxy.createListenableFuture(AsyncRestClientProxy.java:156)
at org.jclouds.rest.internal.AsyncRestClientProxy.invoke(AsyncRestClientProxy.java:126)
at $Proxy65.createServer(Unknown Source)
at sun.reflect.NativeMethodAccessorImpl.invoke0(Native Method)
at sun.reflect.NativeMethodAccessorImpl.invoke(NativeMethodAccessorImpl.java:39)
at sun.reflect.DelegatingMethodAccessorImpl.invoke(DelegatingMethodAccessorImpl.java:25)
at java.lang.reflect.Method.invoke(Method.java:597)
at org.jclouds.concurrent.internal.SyncProxy.invoke(SyncProxy.java:137)
at $Proxy66.createServer(Unknown Source)
at org.jclouds.rimuhosting.miro.compute.strategy.RimuHostingCreateNodeWithGroupEncodedIntoName.createNodeWithGroupEncodedIntoName(RimuHostingCreateNodeWithGroupEncodedIntoName.java:58)
at org.jclouds.compute.strategy.impl.CreateNodesWithGroupEncodedIntoNameThenAddToSet$AddNode.call(CreateNodesWithGroupEncodedIntoNameThenAddToSet.java:80)
at org.jclouds.compute.strategy.impl.CreateNodesWithGroupEncodedIntoNameThenAddToSet$AddNode.call(CreateNodesWithGroupEncodedIntoNameThenAddToSet.java:63)
at java.util.concurrent.FutureTask$Sync.innerRun(FutureTask.java:303)
at java.util.concurrent.FutureTask.run(FutureTask.java:138)
at java.util.concurrent.ThreadPoolExecutor$Worker.runTask(ThreadPoolExecutor.java:886)
at java.util.concurrent.ThreadPoolExecutor$Worker.run(ThreadPoolExecutor.java:908)
at java.lang.Thread.run(Thread.java:680)
at org.jclouds.concurrent.config.ExecutorServiceModule$DescribingExecutorService.submit(ExecutorServiceModule.java:182)
at org.jclouds.compute.strategy.impl.CreateNodesWithGroupEncodedIntoNameThenAddToSet.execute(CreateNodesWithGroupEncodedIntoNameThenAddToSet.java:123)
at org.jclouds.compute.internal.BaseComputeService.createNodesInGroup(BaseComputeService.java:199)
at org.jclouds.compute.BaseComputeServiceLiveTest.testCreateTwoNodesWithRunScript(BaseComputeServiceLiveTest.java:350)
at sun.reflect.NativeMethodAccessorImpl.invoke0(Native Method)
at sun.reflect.NativeMethodAccessorImpl.invoke(NativeMethodAccessorImpl.java:39)
at sun.reflect.DelegatingMethodAccessorImpl.invoke(DelegatingMethodAccessorImpl.java:25)
at java.lang.reflect.Method.invoke(Method.java:597)
at org.testng.internal.MethodInvocationHelper.invokeMethod(MethodInvocationHelper.java:80)
at org.testng.internal.Invoker.invokeMethod(Invoker.java:691)
at org.testng.internal.Invoker.invokeTestMethod(Invoker.java:883)
at org.testng.internal.Invoker.invokeTestMethods(Invoker.java:1208)
at org.testng.internal.TestMethodWorker.invokeTestMethods(TestMethodWorker.java:127)
at org.testng.internal.TestMethodWorker.run(TestMethodWorker.java:111)
at org.testng.TestRunner.privateRun(TestRunner.java:758)
at org.testng.TestRunner.run(TestRunner.java:613)
at org.testng.SuiteRunner.runTest(SuiteRunner.java:334)
at org.testng.SuiteRunner.access$000(SuiteRunner.java:37)
at org.testng.SuiteRunner$SuiteWorker.run(SuiteRunner.java:368)
at org.testng.internal.thread.ThreadUtil$CountDownLatchedRunnable.run(ThreadUtil.java:165)
... 3 more
2) ExecutionException on rimuhosting.jclouds-709:
java.util.concurrent.ExecutionException: org.jclouds.http.HttpResponseException: command: POST https://api.rimuhosting.com/r/orders/new-vps HTTP/1.1 failed with response: HTTP/1.1 406 Not Acceptable; content: [{ "post_new_vps_response" : { "status_message" : "Not Acceptable"
, "status_code" : 406
, "response_created_time" : { "ms_since_epoch": 1326650771128, "iso_format" : "2012-01-15T18:06:11Z", "users_tz_offset_ms" : 46800000}
, "response_created_time_epoch_ms" : 1326650771128
, "error_info" : { "error_class" : "ValidationError"
, "full_error_message" : "memory_mb: The 64 bit distros require a good amount of memory. Try 256MB or more."
, "human_readable_message" : "The 64 bit distros require a good amount of memory. Try 256MB or more."
, "error_title" : "Validation Problem"
, "field_name" : "memory_mb"}
, "extended_error_infos" : [{ "error_class" : "ValidationError"
, "full_error_message" : "memory_mb: The 64 bit distros require a good amount of memory. Try 256MB or more."
, "human_readable_message" : "The 64 bit distros require a good amount of memory. Try 256MB or more."
, "error_title" : "Validation Problem"
, "field_name" : "memory_mb"}]
, "response_type" : "ERROR"
, "human_readable_message" : "The 64 bit distros require a good amount of memory. Try 256MB or more."
, "redirect_uri" : null
, "response_display_duration_type" : "REGULAR"
, "setup_messages" : ["Selected user as the logged in user: Ivan Meredith"
, "Selected billing details as the first 'wire' billing details found for the user: Wire Transfer"
, "No VPS paramters provided, using default values."
, "'memory_mb' not provided, setting to 160MB."
, "'disk_space_mb' not provided, setting to 4GB."
, "memory_mb: The 64 bit distros require a good amount of memory. Try 256MB or more."]
, "about_order" : null
, "new_order_request" : { "billing_oid" : 0
, "user_oid" : 0
, "host_server_oid" : null
, "ip_request" : null
, "vps_parameters" : null
, "pricing_plan_code" : "MIRO4B"
, "dc_location" : null
, "vps_type" : null
, "instantiation_options" : { "domain_name" : "rimuhosting.jclouds-709"
, "control_panel" : "none"
, "password" : "cajerea89"
, "distro" : "ubuntu1110.64"}
, "instantiation_via_clone_options" : null
, "file_injection_data" : null
, "meta_data" : []}
, "running_vps_info" : null}}
]
at com.google.common.util.concurrent.AbstractFuture$Sync.getValue(AbstractFuture.java:289)
at com.google.common.util.concurrent.AbstractFuture$Sync.get(AbstractFuture.java:276)
at com.google.common.util.concurrent.AbstractFuture.get(AbstractFuture.java:111)
at com.google.common.util.concurrent.Futures$ChainingListenableFuture.get(Futures.java:635)
at org.jclouds.concurrent.FutureIterables$1.run(FutureIterables.java:126)
at java.util.concurrent.ThreadPoolExecutor$Worker.runTask(ThreadPoolExecutor.java:886)
at java.util.concurrent.ThreadPoolExecutor$Worker.run(ThreadPoolExecutor.java:908)
at java.lang.Thread.run(Thread.java:680)
Caused by: org.jclouds.http.HttpResponseException: command: POST https://api.rimuhosting.com/r/orders/new-vps HTTP/1.1 failed with response: HTTP/1.1 406 Not Acceptable; content: [{ "post_new_vps_response" : { "status_message" : "Not Acceptable"
, "status_code" : 406
, "response_created_time" : { "ms_since_epoch": 1326650771128, "iso_format" : "2012-01-15T18:06:11Z", "users_tz_offset_ms" : 46800000}
, "response_created_time_epoch_ms" : 1326650771128
, "error_info" : { "error_class" : "ValidationError"
, "full_error_message" : "memory_mb: The 64 bit distros require a good amount of memory. Try 256MB or more."
, "human_readable_message" : "The 64 bit distros require a good amount of memory. Try 256MB or more."
, "error_title" : "Validation Problem"
, "field_name" : "memory_mb"}
, "extended_error_infos" : [{ "error_class" : "ValidationError"
, "full_error_message" : "memory_mb: The 64 bit distros require a good amount of memory. Try 256MB or more."
, "human_readable_message" : "The 64 bit distros require a good amount of memory. Try 256MB or more."
, "error_title" : "Validation Problem"
, "field_name" : "memory_mb"}]
, "response_type" : "ERROR"
, "human_readable_message" : "The 64 bit distros require a good amount of memory. Try 256MB or more."
, "redirect_uri" : null
, "response_display_duration_type" : "REGULAR"
, "setup_messages" : ["Selected user as the logged in user: Ivan Meredith"
, "Selected billing details as the first 'wire' billing details found for the user: Wire Transfer"
, "No VPS paramters provided, using default values."
, "'memory_mb' not provided, setting to 160MB."
, "'disk_space_mb' not provided, setting to 4GB."
, "memory_mb: The 64 bit distros require a good amount of memory. Try 256MB or more."]
, "about_order" : null
, "new_order_request" : { "billing_oid" : 0
, "user_oid" : 0
, "host_server_oid" : null
, "ip_request" : null
, "vps_parameters" : null
, "pricing_plan_code" : "MIRO4B"
, "dc_location" : null
, "vps_type" : null
, "instantiation_options" : { "domain_name" : "rimuhosting.jclouds-709"
, "control_panel" : "none"
, "password" : "cajerea89"
, "distro" : "ubuntu1110.64"}
, "instantiation_via_clone_options" : null
, "file_injection_data" : null
, "meta_data" : []}
, "running_vps_info" : null}}
]
at org.jclouds.http.handlers.CloseContentAndSetExceptionErrorHandler.handleError(CloseContentAndSetExceptionErrorHandler.java:44)
at org.jclouds.http.handlers.DelegatingErrorHandler.handleError(DelegatingErrorHandler.java:69)
at org.jclouds.http.internal.BaseHttpCommandExecutorService$HttpResponseCallable.shouldContinue(BaseHttpCommandExecutorService.java:200)
at org.jclouds.http.internal.BaseHttpCommandExecutorService$HttpResponseCallable.call(BaseHttpCommandExecutorService.java:165)
at org.jclouds.http.internal.BaseHttpCommandExecutorService$HttpResponseCallable.call(BaseHttpCommandExecutorService.java:134)
at java.util.concurrent.FutureTask$Sync.innerRun(FutureTask.java:303)
at java.util.concurrent.FutureTask.run(FutureTask.java:138)
at java.util.concurrent.ThreadPoolExecutor$Worker.runTask(ThreadPoolExecutor.java:886)
at java.util.concurrent.ThreadPoolExecutor$Worker.run(ThreadPoolExecutor.java:908)
at java.lang.Thread.run(Thread.java:680)
at org.jclouds.concurrent.config.ExecutorServiceModule$DescribingExecutorService.submit(ExecutorServiceModule.java:182)
at org.jclouds.http.internal.BaseHttpCommandExecutorService.submit(BaseHttpCommandExecutorService.java:131)
at org.jclouds.http.TransformingHttpCommandExecutorServiceImpl.submit(TransformingHttpCommandExecutorServiceImpl.java:54)
at org.jclouds.http.TransformingHttpCommandImpl.execute(TransformingHttpCommandImpl.java:73)
at org.jclouds.rest.internal.AsyncRestClientProxy.createListenableFuture(AsyncRestClientProxy.java:156)
at org.jclouds.rest.internal.AsyncRestClientProxy.invoke(AsyncRestClientProxy.java:126)
at $Proxy65.createServer(Unknown Source)
at sun.reflect.NativeMethodAccessorImpl.invoke0(Native Method)
at sun.reflect.NativeMethodAccessorImpl.invoke(NativeMethodAccessorImpl.java:39)
at sun.reflect.DelegatingMethodAccessorImpl.invoke(DelegatingMethodAccessorImpl.java:25)
at java.lang.reflect.Method.invoke(Method.java:597)
at org.jclouds.concurrent.internal.SyncProxy.invoke(SyncProxy.java:137)
at $Proxy66.createServer(Unknown Source)
at org.jclouds.rimuhosting.miro.compute.strategy.RimuHostingCreateNodeWithGroupEncodedIntoName.createNodeWithGroupEncodedIntoName(RimuHostingCreateNodeWithGroupEncodedIntoName.java:58)
at org.jclouds.compute.strategy.impl.CreateNodesWithGroupEncodedIntoNameThenAddToSet$AddNode.call(CreateNodesWithGroupEncodedIntoNameThenAddToSet.java:80)
at org.jclouds.compute.strategy.impl.CreateNodesWithGroupEncodedIntoNameThenAddToSet$AddNode.call(CreateNodesWithGroupEncodedIntoNameThenAddToSet.java:63)
at java.util.concurrent.FutureTask$Sync.innerRun(FutureTask.java:303)
at java.util.concurrent.FutureTask.run(FutureTask.java:138)
at java.util.concurrent.ThreadPoolExecutor$Worker.runTask(ThreadPoolExecutor.java:886)
at java.util.concurrent.ThreadPoolExecutor$Worker.run(ThreadPoolExecutor.java:908)
at java.lang.Thread.run(Thread.java:680)
at org.jclouds.concurrent.config.ExecutorServiceModule$DescribingExecutorService.submit(ExecutorServiceModule.java:182)
at org.jclouds.http.internal.BaseHttpCommandExecutorService.submit(BaseHttpCommandExecutorService.java:131)
at org.jclouds.http.TransformingHttpCommandExecutorServiceImpl.submit(TransformingHttpCommandExecutorServiceImpl.java:54)
at org.jclouds.http.TransformingHttpCommandImpl.execute(TransformingHttpCommandImpl.java:73)
at org.jclouds.rest.internal.AsyncRestClientProxy.createListenableFuture(AsyncRestClientProxy.java:156)
at org.jclouds.rest.internal.AsyncRestClientProxy.invoke(AsyncRestClientProxy.java:126)
at $Proxy65.createServer(Unknown Source)
at sun.reflect.NativeMethodAccessorImpl.invoke0(Native Method)
at sun.reflect.NativeMethodAccessorImpl.invoke(NativeMethodAccessorImpl.java:39)
at sun.reflect.DelegatingMethodAccessorImpl.invoke(DelegatingMethodAccessorImpl.java:25)
at java.lang.reflect.Method.invoke(Method.java:597)
at org.jclouds.concurrent.internal.SyncProxy.invoke(SyncProxy.java:137)
at $Proxy66.createServer(Unknown Source)
at org.jclouds.rimuhosting.miro.compute.strategy.RimuHostingCreateNodeWithGroupEncodedIntoName.createNodeWithGroupEncodedIntoName(RimuHostingCreateNodeWithGroupEncodedIntoName.java:58)
at org.jclouds.compute.strategy.impl.CreateNodesWithGroupEncodedIntoNameThenAddToSet$AddNode.call(CreateNodesWithGroupEncodedIntoNameThenAddToSet.java:80)
at org.jclouds.compute.strategy.impl.CreateNodesWithGroupEncodedIntoNameThenAddToSet$AddNode.call(CreateNodesWithGroupEncodedIntoNameThenAddToSet.java:63)
at java.util.concurrent.FutureTask$Sync.innerRun(FutureTask.java:303)
at java.util.concurrent.FutureTask.run(FutureTask.java:138)
at java.util.concurrent.ThreadPoolExecutor$Worker.runTask(ThreadPoolExecutor.java:886)
at java.util.concurrent.ThreadPoolExecutor$Worker.run(ThreadPoolExecutor.java:908)
at java.lang.Thread.run(Thread.java:680)
at org.jclouds.concurrent.config.ExecutorServiceModule$DescribingExecutorService.submit(ExecutorServiceModule.java:182)
at org.jclouds.http.internal.BaseHttpCommandExecutorService.submit(BaseHttpCommandExecutorService.java:131)
at org.jclouds.http.TransformingHttpCommandExecutorServiceImpl.submit(TransformingHttpCommandExecutorServiceImpl.java:54)
at org.jclouds.http.TransformingHttpCommandImpl.execute(TransformingHttpCommandImpl.java:73)
at org.jclouds.rest.internal.AsyncRestClientProxy.createListenableFuture(AsyncRestClientProxy.java:156)
at org.jclouds.rest.internal.AsyncRestClientProxy.invoke(AsyncRestClientProxy.java:126)
at $Proxy65.createServer(Unknown Source)
at sun.reflect.NativeMethodAccessorImpl.invoke0(Native Method)
at sun.reflect.NativeMethodAccessorImpl.invoke(NativeMethodAccessorImpl.java:39)
at sun.reflect.DelegatingMethodAccessorImpl.invoke(DelegatingMethodAccessorImpl.java:25)
at java.lang.reflect.Method.invoke(Method.java:597)
at org.jclouds.concurrent.internal.SyncProxy.invoke(SyncProxy.java:137)
at $Proxy66.createServer(Unknown Source)
at org.jclouds.rimuhosting.miro.compute.strategy.RimuHostingCreateNodeWithGroupEncodedIntoName.createNodeWithGroupEncodedIntoName(RimuHostingCreateNodeWithGroupEncodedIntoName.java:58)
at org.jclouds.compute.strategy.impl.CreateNodesWithGroupEncodedIntoNameThenAddToSet$AddNode.call(CreateNodesWithGroupEncodedIntoNameThenAddToSet.java:80)
at org.jclouds.compute.strategy.impl.CreateNodesWithGroupEncodedIntoNameThenAddToSet$AddNode.call(CreateNodesWithGroupEncodedIntoNameThenAddToSet.java:63)
at java.util.concurrent.FutureTask$Sync.innerRun(FutureTask.java:303)
at java.util.concurrent.FutureTask.run(FutureTask.java:138)
at java.util.concurrent.ThreadPoolExecutor$Worker.runTask(ThreadPoolExecutor.java:886)
at java.util.concurrent.ThreadPoolExecutor$Worker.run(ThreadPoolExecutor.java:908)
at java.lang.Thread.run(Thread.java:680)
at org.jclouds.concurrent.config.ExecutorServiceModule$DescribingExecutorService.submit(ExecutorServiceModule.java:182)
at org.jclouds.compute.strategy.impl.CreateNodesWithGroupEncodedIntoNameThenAddToSet.execute(CreateNodesWithGroupEncodedIntoNameThenAddToSet.java:123)
at org.jclouds.compute.internal.BaseComputeService.createNodesInGroup(BaseComputeService.java:199)
at org.jclouds.compute.BaseComputeServiceLiveTest.testCreateTwoNodesWithRunScript(BaseComputeServiceLiveTest.java:350)
at sun.reflect.NativeMethodAccessorImpl.invoke0(Native Method)
at sun.reflect.NativeMethodAccessorImpl.invoke(NativeMethodAccessorImpl.java:39)
at sun.reflect.DelegatingMethodAccessorImpl.invoke(DelegatingMethodAccessorImpl.java:25)
at java.lang.reflect.Method.invoke(Method.java:597)
at org.testng.internal.MethodInvocationHelper.invokeMethod(MethodInvocationHelper.java:80)
at org.testng.internal.Invoker.invokeMethod(Invoker.java:691)
at org.testng.internal.Invoker.invokeTestMethod(Invoker.java:883)
at org.testng.internal.Invoker.invokeTestMethods(Invoker.java:1208)
at org.testng.internal.TestMethodWorker.invokeTestMethods(TestMethodWorker.java:127)
at org.testng.internal.TestMethodWorker.run(TestMethodWorker.java:111)
at org.testng.TestRunner.privateRun(TestRunner.java:758)
at org.testng.TestRunner.run(TestRunner.java:613)
at org.testng.SuiteRunner.runTest(SuiteRunner.java:334)
at org.testng.SuiteRunner.access$000(SuiteRunner.java:37)
at org.testng.SuiteRunner$SuiteWorker.run(SuiteRunner.java:368)
at org.testng.internal.thread.ThreadUtil$CountDownLatchedRunnable.run(ThreadUtil.java:165)
at java.util.concurrent.ThreadPoolExecutor$Worker.runTask(ThreadPoolExecutor.java:886)
at java.util.concurrent.ThreadPoolExecutor$Worker.run(ThreadPoolExecutor.java:908)
at java.lang.Thread.run(Thread.java:680)
at org.jclouds.concurrent.config.ExecutorServiceModule$DescribingExecutorService.submit(ExecutorServiceModule.java:182)
at org.jclouds.compute.strategy.impl.CreateNodesWithGroupEncodedIntoNameThenAddToSet.execute(CreateNodesWithGroupEncodedIntoNameThenAddToSet.java:123)
at org.jclouds.compute.internal.BaseComputeService.createNodesInGroup(BaseComputeService.java:199)
at org.jclouds.compute.BaseComputeServiceLiveTest.testCreateTwoNodesWithRunScript(BaseComputeServiceLiveTest.java:350)
at sun.reflect.NativeMethodAccessorImpl.invoke0(Native Method)
at sun.reflect.NativeMethodAccessorImpl.invoke(NativeMethodAccessorImpl.java:39)
at sun.reflect.DelegatingMethodAccessorImpl.invoke(DelegatingMethodAccessorImpl.java:25)
at java.lang.reflect.Method.invoke(Method.java:597)
at org.testng.internal.MethodInvocationHelper.invokeMethod(MethodInvocationHelper.java:80)
at org.testng.internal.Invoker.invokeMethod(Invoker.java:691)
at org.testng.internal.Invoker.invokeTestMethod(Invoker.java:883)
at org.testng.internal.Invoker.invokeTestMethods(Invoker.java:1208)
at org.testng.internal.TestMethodWorker.invokeTestMethods(TestMethodWorker.java:127)
at org.testng.internal.TestMethodWorker.run(TestMethodWorker.java:111)
at org.testng.TestRunner.privateRun(TestRunner.java:758)
at org.testng.TestRunner.run(TestRunner.java:613)
at org.testng.SuiteRunner.runTest(SuiteRunner.java:334)
at org.testng.SuiteRunner.access$000(SuiteRunner.java:37)
at org.testng.SuiteRunner$SuiteWorker.run(SuiteRunner.java:368)
at org.testng.internal.thread.ThreadUtil$CountDownLatchedRunnable.run(ThreadUtil.java:165)
... 3 more
2 error[s]
Node failures:
0 error[s]
at org.jclouds.compute.internal.BaseComputeService.createNodesInGroup(BaseComputeService.java:207)
at org.jclouds.compute.BaseComputeServiceLiveTest.testCreateTwoNodesWithRunScript(BaseComputeServiceLiveTest.java:350)
at sun.reflect.NativeMethodAccessorImpl.invoke0(Native Method)
at sun.reflect.NativeMethodAccessorImpl.invoke(NativeMethodAccessorImpl.java:39)
at sun.reflect.DelegatingMethodAccessorImpl.invoke(DelegatingMethodAccessorImpl.java:25)
at java.lang.reflect.Method.invoke(Method.java:597)
at org.testng.internal.MethodInvocationHelper.invokeMethod(MethodInvocationHelper.java:80)
at org.testng.internal.Invoker.invokeMethod(Invoker.java:691)
at org.testng.internal.Invoker.invokeTestMethod(Invoker.java:883)
at org.testng.internal.Invoker.invokeTestMethods(Invoker.java:1208)
at org.testng.internal.TestMethodWorker.invokeTestMethods(TestMethodWorker.java:127)
at org.testng.internal.TestMethodWorker.run(TestMethodWorker.java:111)
at org.testng.TestRunner.privateRun(TestRunner.java:758)
at org.testng.TestRunner.run(TestRunner.java:613)
at org.testng.SuiteRunner.runTest(SuiteRunner.java:334)
at org.testng.SuiteRunner.access$000(SuiteRunner.java:37)
at org.testng.SuiteRunner$SuiteWorker.run(SuiteRunner.java:368)
at org.testng.internal.thread.ThreadUtil$CountDownLatchedRunnable.run(ThreadUtil.java:165)
at java.util.concurrent.ThreadPoolExecutor$Worker.runTask(ThreadPoolExecutor.java:886)
at java.util.concurrent.ThreadPoolExecutor$Worker.run(ThreadPoolExecutor.java:908)
at java.lang.Thread.run(Thread.java:680)
Caused by: org.jclouds.http.HttpResponseException: command: POST https://api.rimuhosting.com/r/orders/new-vps HTTP/1.1 failed with response: HTTP/1.1 406 Not Acceptable; content: [{ "post_new_vps_response" : { "status_message" : "Not Acceptable"
, "status_code" : 406
, "response_created_time" : { "ms_since_epoch": 1326650771130, "iso_format" : "2012-01-15T18:06:11Z", "users_tz_offset_ms" : 46800000}
, "response_created_time_epoch_ms" : 1326650771130
, "error_info" : { "error_class" : "ValidationError"
, "full_error_message" : "memory_mb: The 64 bit distros require a good amount of memory. Try 256MB or more."
, "human_readable_message" : "The 64 bit distros require a good amount of memory. Try 256MB or more."
, "error_title" : "Validation Problem"
, "field_name" : "memory_mb"}
, "extended_error_infos" : [{ "error_class" : "ValidationError"
, "full_error_message" : "memory_mb: The 64 bit distros require a good amount of memory. Try 256MB or more."
, "human_readable_message" : "The 64 bit distros require a good amount of memory. Try 256MB or more."
, "error_title" : "Validation Problem"
, "field_name" : "memory_mb"}]
, "response_type" : "ERROR"
, "human_readable_message" : "The 64 bit distros require a good amount of memory. Try 256MB or more."
, "redirect_uri" : null
, "response_display_duration_type" : "REGULAR"
, "setup_messages" : ["Selected user as the logged in user: Ivan Meredith"
, "Selected billing details as the first 'wire' billing details found for the user: Wire Transfer"
, "No VPS paramters provided, using default values."
, "'memory_mb' not provided, setting to 160MB."
, "'disk_space_mb' not provided, setting to 4GB."
, "memory_mb: The 64 bit distros require a good amount of memory. Try 256MB or more."]
, "about_order" : null
, "new_order_request" : { "billing_oid" : 0
, "user_oid" : 0
, "host_server_oid" : null
, "ip_request" : null
, "vps_parameters" : null
, "pricing_plan_code" : "MIRO4B"
, "dc_location" : null
, "vps_type" : null
, "instantiation_options" : { "domain_name" : "rimuhosting.jclouds-565"
, "control_panel" : "none"
, "password" : "faerew23"
, "distro" : "ubuntu1110.64"}
, "instantiation_via_clone_options" : null
, "file_injection_data" : null
, "meta_data" : []}
, "running_vps_info" : null}}
]
at org.jclouds.http.handlers.CloseContentAndSetExceptionErrorHandler.handleError(CloseContentAndSetExceptionErrorHandler.java:44)
at org.jclouds.http.handlers.DelegatingErrorHandler.handleError(DelegatingErrorHandler.java:69)
at org.jclouds.http.internal.BaseHttpCommandExecutorService$HttpResponseCallable.shouldContinue(BaseHttpCommandExecutorService.java:200)
at org.jclouds.http.internal.BaseHttpCommandExecutorService$HttpResponseCallable.call(BaseHttpCommandExecutorService.java:165)
at org.jclouds.http.internal.BaseHttpCommandExecutorService$HttpResponseCallable.call(BaseHttpCommandExecutorService.java:134)
at java.util.concurrent.FutureTask$Sync.innerRun(FutureTask.java:303)
at java.util.concurrent.FutureTask.run(FutureTask.java:138)
at java.util.concurrent.ThreadPoolExecutor$Worker.runTask(ThreadPoolExecutor.java:886)
at java.util.concurrent.ThreadPoolExecutor$Worker.run(ThreadPoolExecutor.java:908)
at java.lang.Thread.run(Thread.java:680)
at org.jclouds.concurrent.config.ExecutorServiceModule$DescribingExecutorService.submit(ExecutorServiceModule.java:182)
at org.jclouds.http.internal.BaseHttpCommandExecutorService.submit(BaseHttpCommandExecutorService.java:131)
at org.jclouds.http.TransformingHttpCommandExecutorServiceImpl.submit(TransformingHttpCommandExecutorServiceImpl.java:54)
at org.jclouds.http.TransformingHttpCommandImpl.execute(TransformingHttpCommandImpl.java:73)
at org.jclouds.rest.internal.AsyncRestClientProxy.createListenableFuture(AsyncRestClientProxy.java:156)
at org.jclouds.rest.internal.AsyncRestClientProxy.invoke(AsyncRestClientProxy.java:126)
at $Proxy65.createServer(Unknown Source)
at sun.reflect.NativeMethodAccessorImpl.invoke0(Native Method)
at sun.reflect.NativeMethodAccessorImpl.invoke(NativeMethodAccessorImpl.java:39)
at sun.reflect.DelegatingMethodAccessorImpl.invoke(DelegatingMethodAccessorImpl.java:25)
at java.lang.reflect.Method.invoke(Method.java:597)
at org.jclouds.concurrent.internal.SyncProxy.invoke(SyncProxy.java:137)
at $Proxy66.createServer(Unknown Source)
at org.jclouds.rimuhosting.miro.compute.strategy.RimuHostingCreateNodeWithGroupEncodedIntoName.createNodeWithGroupEncodedIntoName(RimuHostingCreateNodeWithGroupEncodedIntoName.java:58)
at org.jclouds.compute.strategy.impl.CreateNodesWithGroupEncodedIntoNameThenAddToSet$AddNode.call(CreateNodesWithGroupEncodedIntoNameThenAddToSet.java:80)
at org.jclouds.compute.strategy.impl.CreateNodesWithGroupEncodedIntoNameThenAddToSet$AddNode.call(CreateNodesWithGroupEncodedIntoNameThenAddToSet.java:63)
at java.util.concurrent.FutureTask$Sync.innerRun(FutureTask.java:303)
at java.util.concurrent.FutureTask.run(FutureTask.java:138)
at java.util.concurrent.ThreadPoolExecutor$Worker.runTask(ThreadPoolExecutor.java:886)
at java.util.concurrent.ThreadPoolExecutor$Worker.run(ThreadPoolExecutor.java:908)
at java.lang.Thread.run(Thread.java:680)
at org.jclouds.concurrent.config.ExecutorServiceModule$DescribingExecutorService.submit(ExecutorServiceModule.java:182)
at org.jclouds.http.internal.BaseHttpCommandExecutorService.submit(BaseHttpCommandExecutorService.java:131)
at org.jclouds.http.TransformingHttpCommandExecutorServiceImpl.submit(TransformingHttpCommandExecutorServiceImpl.java:54)
at org.jclouds.http.TransformingHttpCommandImpl.execute(TransformingHttpCommandImpl.java:73)
at org.jclouds.rest.internal.AsyncRestClientProxy.createListenableFuture(AsyncRestClientProxy.java:156)
at org.jclouds.rest.internal.AsyncRestClientProxy.invoke(AsyncRestClientProxy.java:126)
at $Proxy65.createServer(Unknown Source)
at sun.reflect.NativeMethodAccessorImpl.invoke0(Native Method)
at sun.reflect.NativeMethodAccessorImpl.invoke(NativeMethodAccessorImpl.java:39)
at sun.reflect.DelegatingMethodAccessorImpl.invoke(DelegatingMethodAccessorImpl.java:25)
at java.lang.reflect.Method.invoke(Method.java:597)
at org.jclouds.concurrent.internal.SyncProxy.invoke(SyncProxy.java:137)
at $Proxy66.createServer(Unknown Source)
at org.jclouds.rimuhosting.miro.compute.strategy.RimuHostingCreateNodeWithGroupEncodedIntoName.createNodeWithGroupEncodedIntoName(RimuHostingCreateNodeWithGroupEncodedIntoName.java:58)
at org.jclouds.compute.strategy.impl.CreateNodesWithGroupEncodedIntoNameThenAddToSet$AddNode.call(CreateNodesWithGroupEncodedIntoNameThenAddToSet.java:80)
at org.jclouds.compute.strategy.impl.CreateNodesWithGroupEncodedIntoNameThenAddToSet$AddNode.call(CreateNodesWithGroupEncodedIntoNameThenAddToSet.java:63)
at java.util.concurrent.FutureTask$Sync.innerRun(FutureTask.java:303)
at java.util.concurrent.FutureTask.run(FutureTask.java:138)
at java.util.concurrent.ThreadPoolExecutor$Worker.runTask(ThreadPoolExecutor.java:886)
at java.util.concurrent.ThreadPoolExecutor$Worker.run(ThreadPoolExecutor.java:908)
at java.lang.Thread.run(Thread.java:680)
at org.jclouds.concurrent.config.ExecutorServiceModule$DescribingExecutorService.submit(ExecutorServiceModule.java:182)
at org.jclouds.compute.strategy.impl.CreateNodesWithGroupEncodedIntoNameThenAddToSet.execute(CreateNodesWithGroupEncodedIntoNameThenAddToSet.java:123)
at org.jclouds.compute.internal.BaseComputeService.createNodesInGroup(BaseComputeService.java:199)
at org.jclouds.compute.BaseComputeServiceLiveTest.testCreateTwoNodesWithRunScript(BaseComputeServiceLiveTest.java:350)
at sun.reflect.NativeMethodAccessorImpl.invoke0(Native Method)
at sun.reflect.NativeMethodAccessorImpl.invoke(NativeMethodAccessorImpl.java:39)
at sun.reflect.DelegatingMethodAccessorImpl.invoke(DelegatingMethodAccessorImpl.java:25)
at java.lang.reflect.Method.invoke(Method.java:597)
at org.testng.internal.MethodInvocationHelper.invokeMethod(MethodInvocationHelper.java:80)
at org.testng.internal.Invoker.invokeMethod(Invoker.java:691)
at org.testng.internal.Invoker.invokeTestMethod(Invoker.java:883)
at org.testng.internal.Invoker.invokeTestMethods(Invoker.java:1208)
at org.testng.internal.TestMethodWorker.invokeTestMethods(TestMethodWorker.java:127)
at org.testng.internal.TestMethodWorker.run(TestMethodWorker.java:111)
at org.testng.TestRunner.privateRun(TestRunner.java:758)
at org.testng.TestRunner.run(TestRunner.java:613)
at org.testng.SuiteRunner.runTest(SuiteRunner.java:334)
at org.testng.SuiteRunner.access$000(SuiteRunner.java:37)
at org.testng.SuiteRunner$SuiteWorker.run(SuiteRunner.java:368)
at org.testng.internal.thread.ThreadUtil$CountDownLatchedRunnable.run(ThreadUtil.java:165)
at java.util.concurrent.ThreadPoolExecutor$Worker.runTask(ThreadPoolExecutor.java:886)
at java.util.concurrent.ThreadPoolExecutor$Worker.run(ThreadPoolExecutor.java:908)
at java.lang.Thread.run(Thread.java:680)
at org.jclouds.concurrent.config.ExecutorServiceModule$DescribingExecutorService.submit(ExecutorServiceModule.java:182)
at org.jclouds.http.internal.BaseHttpCommandExecutorService.submit(BaseHttpCommandExecutorService.java:131)
at org.jclouds.http.TransformingHttpCommandExecutorServiceImpl.submit(TransformingHttpCommandExecutorServiceImpl.java:54)
at org.jclouds.http.TransformingHttpCommandImpl.execute(TransformingHttpCommandImpl.java:73)
at org.jclouds.rest.internal.AsyncRestClientProxy.createListenableFuture(AsyncRestClientProxy.java:156)
at org.jclouds.rest.internal.AsyncRestClientProxy.invoke(AsyncRestClientProxy.java:126)
at $Proxy65.createServer(Unknown Source)
at sun.reflect.NativeMethodAccessorImpl.invoke0(Native Method)
at sun.reflect.NativeMethodAccessorImpl.invoke(NativeMethodAccessorImpl.java:39)
at sun.reflect.DelegatingMethodAccessorImpl.invoke(DelegatingMethodAccessorImpl.java:25)
at java.lang.reflect.Method.invoke(Method.java:597)
at org.jclouds.concurrent.internal.SyncProxy.invoke(SyncProxy.java:137)
at $Proxy66.createServer(Unknown Source)
at org.jclouds.rimuhosting.miro.compute.strategy.RimuHostingCreateNodeWithGroupEncodedIntoName.createNodeWithGroupEncodedIntoName(RimuHostingCreateNodeWithGroupEncodedIntoName.java:58)
at org.jclouds.compute.strategy.impl.CreateNodesWithGroupEncodedIntoNameThenAddToSet$AddNode.call(CreateNodesWithGroupEncodedIntoNameThenAddToSet.java:80)
at org.jclouds.compute.strategy.impl.CreateNodesWithGroupEncodedIntoNameThenAddToSet$AddNode.call(CreateNodesWithGroupEncodedIntoNameThenAddToSet.java:63)
at java.util.concurrent.FutureTask$Sync.innerRun(FutureTask.java:303)
at java.util.concurrent.FutureTask.run(FutureTask.java:138)
at java.util.concurrent.ThreadPoolExecutor$Worker.runTask(ThreadPoolExecutor.java:886)
at java.util.concurrent.ThreadPoolExecutor$Worker.run(ThreadPoolExecutor.java:908)
at java.lang.Thread.run(Thread.java:680)
at org.jclouds.concurrent.config.ExecutorServiceModule$DescribingExecutorService.submit(ExecutorServiceModule.java:182)
at org.jclouds.compute.strategy.impl.CreateNodesWithGroupEncodedIntoNameThenAddToSet.execute(CreateNodesWithGroupEncodedIntoNameThenAddToSet.java:123)
at org.jclouds.compute.internal.BaseComputeService.createNodesInGroup(BaseComputeService.java:199)
at org.jclouds.compute.BaseComputeServiceLiveTest.testCreateTwoNodesWithRunScript(BaseComputeServiceLiveTest.java:350)
at sun.reflect.NativeMethodAccessorImpl.invoke0(Native Method)
at sun.reflect.NativeMethodAccessorImpl.invoke(NativeMethodAccessorImpl.java:39)
at sun.reflect.DelegatingMethodAccessorImpl.invoke(DelegatingMethodAccessorImpl.java:25)
at java.lang.reflect.Method.invoke(Method.java:597)
at org.testng.internal.MethodInvocationHelper.invokeMethod(MethodInvocationHelper.java:80)
at org.testng.internal.Invoker.invokeMethod(Invoker.java:691)
at org.testng.internal.Invoker.invokeTestMethod(Invoker.java:883)
at org.testng.internal.Invoker.invokeTestMethods(Invoker.java:1208)
at org.testng.internal.TestMethodWorker.invokeTestMethods(TestMethodWorker.java:127)
at org.testng.internal.TestMethodWorker.run(TestMethodWorker.java:111)
at org.testng.TestRunner.privateRun(TestRunner.java:758)
at org.testng.TestRunner.run(TestRunner.java:613)
at org.testng.SuiteRunner.runTest(SuiteRunner.java:334)
at org.testng.SuiteRunner.access$000(SuiteRunner.java:37)
at org.testng.SuiteRunner$SuiteWorker.run(SuiteRunner.java:368)
at org.testng.internal.thread.ThreadUtil$CountDownLatchedRunnable.run(ThreadUtil.java:165)
... 3 more
2) ExecutionException on rimuhosting.jclouds-709:
java.util.concurrent.ExecutionException: org.jclouds.http.HttpResponseException: command: POST https://api.rimuhosting.com/r/orders/new-vps HTTP/1.1 failed with response: HTTP/1.1 406 Not Acceptable; content: [{ "post_new_vps_response" : { "status_message" : "Not Acceptable"
, "status_code" : 406
, "response_created_time" : { "ms_since_epoch": 1326650771128, "iso_format" : "2012-01-15T18:06:11Z", "users_tz_offset_ms" : 46800000}
, "response_created_time_epoch_ms" : 1326650771128
, "error_info" : { "error_class" : "ValidationError"
, "full_error_message" : "memory_mb: The 64 bit distros require a good amount of memory. Try 256MB or more."
, "human_readable_message" : "The 64 bit distros require a good amount of memory. Try 256MB or more."
, "error_title" : "Validation Problem"
, "field_name" : "memory_mb"}
, "extended_error_infos" : [{ "error_class" : "ValidationError"
, "full_error_message" : "memory_mb: The 64 bit distros require a good amount of memory. Try 256MB or more."
, "human_readable_message" : "The 64 bit distros require a good amount of memory. Try 256MB or more."
, "error_title" : "Validation Problem"
, "field_name" : "memory_mb"}]
, "response_type" : "ERROR"
, "human_readable_message" : "The 64 bit distros require a good amount of memory. Try 256MB or more."
, "redirect_uri" : null
, "response_display_duration_type" : "REGULAR"
, "setup_messages" : ["Selected user as the logged in user: Ivan Meredith"
, "Selected billing details as the first 'wire' billing details found for the user: Wire Transfer"
, "No VPS paramters provided, using default values."
, "'memory_mb' not provided, setting to 160MB."
, "'disk_space_mb' not provided, setting to 4GB."
, "memory_mb: The 64 bit distros require a good amount of memory. Try 256MB or more."]
, "about_order" : null
, "new_order_request" : { "billing_oid" : 0
, "user_oid" : 0
, "host_server_oid" : null
, "ip_request" : null
,